Build failure in llvm trunk

hi,
I am trying to build the llvm trunk with make. I am trying a debug build and I am ending with the following build error.

/home/rajika/projects/llvm/llvm/lib/Target/TargetLoweringObjectFile.cpp: In member function ‘virtual bool llvm::TargetLoweringObjectFileMachO::shouldEmitUsedDirectiveFor(const llvm::GlobalValue*, llvm::Mangler*) const’:
/home/rajika/projects/llvm/llvm/lib/Target/TargetLoweringObjectFile.cpp:959: error: ‘NameTmp’ was not declared in this scope
make[2]: *** [/home/rajika/projects/llvm/llvm-objects/lib/Target/Debug/TargetLoweringObjectFile.o] Error 1
make[2]: Leaving directory /home/rajika/projects/llvm/llvm-objects/lib/Target' make[1]: *** [Target/.makeall] Error 2 make[1]: Leaving directory /home/rajika/projects/llvm/llvm-objects/lib’
make: *** [all] Error 1

Rajika

Doh, that's my fault. Fixed in r93628