LLVM 11.0.1-final has been tagged

Hi,

I've tagged LLVM 11.0.1-final. Testers can upload the final binaries now.

-Tom

Ubuntu 20.10 uploaded.
sha256sum clang+llvm-11.0.1-x86_64-linux-gnu-ubuntu-20.10.tar.xz
b60f68581182ace5f7d4a72e5cce61c01adc88050acb72b2070ad298c25071bc

FAIL: SanitizerCommon-Unit :: ./Sanitizer-x86_64-Test/SanitizerLinux.ThreadDescriptorSize (66433 of 71984)
******************** TEST ‘SanitizerCommon-Unit :: ./Sanitizer-x86_64-Test/SanitizerLinux.ThreadDescriptorSize’ FAILED ********************
Note: Google Test filter = SanitizerLinux.ThreadDescriptorSize
[==========] Running 1 test from 1 test case.
[----------] Global test environment set-up.
[----------] 1 test from SanitizerLinux
[ RUN ] SanitizerLinux.ThreadDescriptorSize
/home/nnelson/Documents/llvm-project/llvm/utils/release/final/llvm-project/compiler-rt/lib/sanitizer_common/tests/sanitizer_linux_test.cpp:222: Failure
Expected: (uptr)result
Which is: 2496
To be equal to: ThreadDescriptorSize()
Which is: 2304
[ FAILED ] SanitizerLinux.ThreadDescriptorSize (0 ms)
[----------] 1 test from SanitizerLinux (0 ms total)

[----------] Global test environment tear-down
[==========] 1 test from 1 test case ran. (0 ms total)
[ PASSED ] 0 tests.
[ FAILED ] 1 test, listed below:
[ FAILED ] SanitizerLinux.ThreadDescriptorSize

1 FAILED TEST

Hi Tom and thanks for the tag,

There seems to be an issue with the llvm-test

% curl -L https://github.com/llvm/llvm-project/releases/download/llvmorg-11.0.1/test-suite-11.0.1.src.tar.xz | tar tJ | wc -l
29

Most files are missing :-/

Hi Tom and thanks for the tag,

There seems to be an issue with the llvm-test

 % curl \-L https://github.com/llvm/llvm-project/releases/download/llvmorg-11.0.1/test-suite-11.0.1.src.tar.xz > tar tJ | wc \-l
 29

Most files are missing :-/

This should be fixed now.

-Tom

Windows is ready:

$ sha256sum LLVM-11.0.1-win*.exe
76886461d2638ed16625a5e2dee35eae2202814fa9f9d99bd983f12d50f581ae
LLVM-11.0.1-win32.exe
d17bd0e556115c30ff45e30a3f9a623af89ad6a345a5df3ac47aa8b9eabab9a7
LLVM-11.0.1-win64.exe

Built with the attached batch file.

build_llvm_1101-final.bat|attachment (4.91 KB)

For 11.0.1 release, I have built and tested on both FreeBSD 11 and 12
this time. No additional patches were needed.

Main results on amd64-freebsd11:

  Unsupported : 5122 (11.0.1 rc2: 5122)
  Passed : 69797 (11.0.1 rc2: 69796)
  Expectedly Failed : 246 (11.0.1 rc2: 246)
  Timed Out : 16 (11.0.1 rc2: 16)
  Failed : 479 (11.0.1 rc2: 480)
  Unexpectedly Passed: 2 (11.0.1 rc2: 2)

Test suite results on amd64-freebsd11:

  Passed: 2399 (11.0.1 rc2: 2399)
  Failed: 3 (11.0.1 rc2: 3)

Main results on amd64-freebsd12:

  Unsupported : 5122 (11.0.1 rc2: 5122)
  Passed : 69794 (11.0.1 rc2: 69793)
  Expectedly Failed : 246 (11.0.1 rc2: 246)
  Timed Out : 16 (11.0.1 rc2: 16)
  Failed : 482 (11.0.1 rc2: 483)
  Unexpectedly Passed: 2 (11.0.1 rc2: 2)

Test suite results on amd64-freebsd12:

  Passed: 2399 (11.0.1 rc2: 2399)
  Failed: 3 (11.0.1 rc2: 3)

Main results on i386-freebsd11:

  Unsupported : 3513 (11.0.1 rc2: 3513)
  Passed : 66675 (11.0.1 rc2: 66675)
  Expectedly Failed : 231 (11.0.1 rc2: 231)
  Timed Out : 7 (11.0.1 rc2: 7)
  Failed : 317 (11.0.1 rc2: 317)
  Unexpectedly Passed: 1 (11.0.1 rc2: 1)

Main results on i386-freebsd12:

  Unsupported : 3513 (11.0.1 rc2: 3513)
  Passed : 66670 (11.0.1 rc2: 66670)
  Expectedly Failed : 231 (11.0.1 rc2: 231)
  Timed Out : 7 (11.0.1 rc2: 7)
  Failed : 322 (11.0.1 rc2: 322)
  Unexpectedly Passed: 1 (11.0.1 rc2: 1)

Uploaded:
SHA256 (clang+llvm-11.0.1-amd64-unknown-freebsd11.tar.xz) = cd0a6da1825bc7440c5a8dfa22add4ee91953c45aa0e5597ba1a5caf347f807d
SHA256 (clang+llvm-11.0.1-amd64-unknown-freebsd12.tar.xz) = 2daa205f87d2b81a281f3883c2102cd69ac017193b19ea30f914b57f904c7c4b
SHA256 (clang+llvm-11.0.1-i386-unknown-freebsd11.tar.xz) = e32ad587e800145a7868449b1416e25d05a6ca08c071ecc8173cf9e1b0b7dcdd
SHA256 (clang+llvm-11.0.1-i386-unknown-freebsd12.tar.xz) = 46e88ce3a5efef198cade0cf29ee152f3361ca4488fd7701cc79485c06aa93b8

-Dimitry

Gentoo's shipping them since the day before yesterday, and nothing new
to report compared to the last RC.

Hello

Uploaded in Debian, nothing in particular!

Firefox nightly is also using 11.0.1, works great for now!

Cheers,
Sylvestre

Hi,

I finished testing llvm-11.0.1 on Power PC 64-bit Little Endian for

  • Ubuntu 18.04
  • Red Hat 7.4
    I have uploaded the binaries from IBM. The sha1 files are attached.

Thanks,
Ahsan Saghir.

clang+llvm-11.0.1-powerpc64le-linux-rhel-7.4.sha1 (94 Bytes)

clang+llvm-11.0.1-powerpc64le-linux-ubuntu-18.04.sha1 (98 Bytes)

clang+llvm-11.0.1-x86_64-apple-darwin.tar.xz is uploaded.
SHA256: 78ec19d60c459a86acfd5673bfc4b750c572cbbbb2e8daaeda70bffbf5d0c4b7

Same two tests as the last couple releases are still failing
FAIL: libunwind :: libunwind_01.pass.cpp (69274 of 69321)
FAIL: libunwind :: signal_frame.pass.cpp (69277 of 69321)

Thanks,
Tobias

Hi,

Uploaded aarch64 & armv7. No new failures.

39b3d3e3b534e327d90c77045058e5fc924b1a81d349eac2be6fb80f4a0e40d4 clang+llvm-11.0.1-aarch64-linux-gnu.tar.xz
5c6b3a1104ac3999c11e18b42c7feca47e0bb894d55b938aba32b1c362402a52 clang+llvm-11.0.1-armv7a-linux-gnueabihf.tar.xz

Cheers,
Diana

Uploaded Ubuntu 16, SLES12.

$ cat clang+llvm-11.0.1-x86_64-linux-sles12.4.tar.xz.sha256 clang+llvm-11.0.1-x86_64-linux-gnu-ubuntu-16.04.tar.xz.sha256
77cd59cf6f932cf2b3c9a68789d1bd3f7ba9f471a28f6ba25e25deb1a0806e0d clang+llvm-11.0.1-x86_64-linux-sles12.4.tar.xz
67f18660231d7dd09dc93502f712613247b7b4395e6f48c11226629b250b53c5 clang+llvm-11.0.1-x86_64-linux-gnu-ubuntu-16.04.tar.xz