llvm-gcc4.2 bootstrap broken?

Is anyone able to bootstrap llvm-gcc42 svn on x86_64-apple-darwin10? Currently it is
failing here with...

/sw/src/fink.build/llvm-gcc42-2.9-0/llvm_gcc42_objdir/./prev-gcc/xgcc -B/sw/src/fink.build/llvm-gcc42-2.9-0/llvm_gcc42_objdir/./prev-gcc/ -B/sw/lib/llvm-gcc-4.2/x86_64-apple-darwin10/bin/ -c -g -O2 -mdynamic-no-pic -DIN_GCC -W -Wall -Wwrite-strings -Wstrict-prototypes -Wmissing-prototypes -pedantic -Wno-long-long -Wno-variadic-macros -Wno-overlength-strings -Wold-style-definition -Wmissing-format-attribute -mdynamic-no-pic -DHAVE_CONFIG_H -I. -I. -I../../llvm-gcc-4.2-2.9.source/gcc -I../../llvm-gcc-4.2-2.9.source/gcc/. -I../../llvm-gcc-4.2-2.9.source/gcc/../include -I../../llvm-gcc-4.2-2.9.source/gcc/../libcpp/include -I/sw/include -I../../llvm-gcc-4.2-2.9.source/gcc/../libdecnumber -I../libdecnumber -I/sw/include -I/sw/include -DENABLE_LLVM -I/sw/include -D_DEBUG -D_GNU_SOURCE -D__STDC_LIMIT_MACROS -D__STDC_CONSTANT_MACROS ../../llvm-gcc-4.2-2.9.source/gcc/tree-iterator.c -o tree-iterator.o
/var/tmp//ccopwjpg.s:unknown:Non-global symbol: _iasm_addr.eh can't be a weak_definition
/var/tmp//ccopwjpg.s:unknown:Non-global symbol: _iasm_build_bracket.eh can't be a weak_definition
/var/tmp//ccopwjpg.s:unknown:Non-global symbol: _iasm_force_constraint.eh can't be a weak_definition
/var/tmp//ccopwjpg.s:unknown:Non-global symbol: _iasm_get_register_var.eh can't be a weak_definition
/var/tmp//ccopwjpg.s:unknown:Non-global symbol: _iasm_is_pseudo.eh can't be a weak_definition
/var/tmp//ccopwjpg.s:unknown:Non-global symbol: _iasm_print_operand.eh can't be a weak_definition
/var/tmp//ccopwjpg.s:unknown:Non-global symbol: _build_modify_expr.eh can't be a weak_definition
/var/tmp//ccopwjpg.s:unknown:Non-global symbol: _decl_constant_value.eh can't be a weak_definition
/var/tmp//ccopwjpg.s:unknown:Non-global symbol: _build_function_call.eh can't be a weak_definition
/var/tmp//ccopwjpg.s:unknown:Non-global symbol: _build_stmt.eh can't be a weak_definition
/var/tmp//ccopwjpg.s:unknown:Non-global symbol: _lookup_name.eh can't be a weak_definition
/var/tmp//ccopwjpg.s:unknown:Non-global symbol: _pointer_int_sum.eh can't be a weak_definition
/var/tmp//ccopwjpg.s:unknown:Non-global symbol: _store_init_value.eh can't be a weak_definition
/var/tmp//ccopwjpg.s:unknown:Non-global symbol: _cvt_utf8_utf16.eh can't be a weak_definition
/var/tmp//ccopwjpg.s:unknown:Non-global symbol: _create_init_utf16_var.eh can't be a weak_definition
/var/tmp//ccopwjpg.s:unknown:Non-global symbol: _pushdecl_top_level.eh can't be a weak_definition
make[3]: *** [stub-c.o] Error 1
make[3]: *** Waiting for unfinished jobs....
rm fsf-funding.pod gcov.pod gfdl.pod cpp.pod gfortran.pod gpl.pod gcc.pod
make[2]: *** [all-stage2-gcc] Error 2
make[1]: *** [stage2-bubble] Error 2
make: *** [all] Error 2
### execution of /var/tmp/tmp.1.b4VcRD failed, exit code 2

It was broken. I think I've fixed it in reverting 125960.

-eric

Eric,
   The llvm-gcc42 bootstrap is fixed in current svn. FYI, the current polyhedron 2005 results are below.
Compared to the previous results on 18 Sep 2010 for llvm 2.8, the regressions in ac are retained and
aermod is now also regressed 13% as well as fatigue by 12%.
                 Jack

Urgh.

Thanks for the mail. There's not a lot I can do about this right now, but if you file bugs with testcases we can run and play with then that'd help and we might be able get things done as we can.

Thanks!

-eric