llvm-gfortran test results

The current llvm/llvm-gcc4.2 svn is now fixed with
respect to the extra warnings that were being emitted
by the gfortran compiler. The gfortran testsuite results
under Intel Darwin9 are appended below.
              Jack

Native configuration is i686-apple-darwin9

    === gfortran tests ===

Running target unix/-m32
FAIL: gfortran.dg/aint_anint_1.f90 -O (internal compiler error)
FAIL: gfortran.dg/aint_anint_1.f90 -O (test for excess errors)
FAIL: gfortran.dg/array_constructor_11.f90 -O0 (internal compiler error)
FAIL: gfortran.dg/array_constructor_11.f90 -O0 (test for excess errors)
WARNING: gfortran.dg/array_constructor_11.f90 -O0 compilation failed to produce executable
FAIL: gfortran.dg/array_constructor_11.f90 -O1 (internal compiler error)
FAIL: gfortran.dg/array_constructor_11.f90 -O1 (test for excess errors)
WARNING: gfortran.dg/array_constructor_11.f90 -O1 compilation failed to produce executable
FAIL: gfortran.dg/array_constructor_11.f90 -O2 (internal compiler error)
FAIL: gfortran.dg/array_constructor_11.f90 -O2 (test for excess errors)
WARNING: gfortran.dg/array_constructor_11.f90 -O2 compilation failed to produce executable
FAIL: gfortran.dg/array_constructor_11.f90 -O3 -fomit-frame-pointer (internal compiler error)
FAIL: gfortran.dg/array_constructor_11.f90 -O3 -fomit-frame-pointer (test for excess errors)
WARNING: gfortran.dg/array_constructor_11.f90 -O3 -fomit-frame-pointer compilation failed to produce executable
FAIL: gfortran.dg/array_constructor_11.f90 -O3 -fomit-frame-pointer -funroll-loops (internal compiler error)
FAIL: gfortran.dg/array_constructor_11.f90 -O3 -fomit-frame-pointer -funroll-loops (test for excess errors)
WARNING: gfortran.dg/array_constructor_11.f90 -O3 -fomit-frame-pointer -funroll-loops compilation failed to produce executable
FAIL: gfortran.dg/array_constructor_11.f90 -O3 -fomit-frame-pointer -funroll-all-loops -finline-functions (internal compiler error)
FAIL: gfortran.dg/array_constructor_11.f90 -O3 -fomit-frame-pointer -funroll-all-loops -finline-functions (test for excess errors)
WARNING: gfortran.dg/array_constructor_11.f90 -O3 -fomit-frame-pointer -funroll-all-loops -finline-functions compilation failed to produce executable
FAIL: gfortran.dg/array_constructor_11.f90 -O3 -g (internal compiler error)
FAIL: gfortran.dg/array_constructor_11.f90 -O3 -g (test for excess errors)
WARNING: gfortran.dg/array_constructor_11.f90 -O3 -g compilation failed to produce executable
FAIL: gfortran.dg/array_constructor_11.f90 -Os (internal compiler error)
FAIL: gfortran.dg/array_constructor_11.f90 -Os (test for excess errors)
WARNING: gfortran.dg/array_constructor_11.f90 -Os compilation failed to produce executable
FAIL: gfortran.dg/array_constructor_12.f90 -O0 (internal compiler error)
FAIL: gfortran.dg/array_constructor_12.f90 -O0 (test for excess errors)
WARNING: gfortran.dg/array_constructor_12.f90 -O0 compilation failed to produce executable
FAIL: gfortran.dg/array_constructor_12.f90 -O1 (internal compiler error)
FAIL: gfortran.dg/array_constructor_12.f90 -O1 (test for excess errors)
WARNING: gfortran.dg/array_constructor_12.f90 -O1 compilation failed to produce executable
FAIL: gfortran.dg/array_constructor_12.f90 -O2 (internal compiler error)
FAIL: gfortran.dg/array_constructor_12.f90 -O2 (test for excess errors)
WARNING: gfortran.dg/array_constructor_12.f90 -O2 compilation failed to produce executable
FAIL: gfortran.dg/array_constructor_12.f90 -O3 -fomit-frame-pointer (internal compiler error)
FAIL: gfortran.dg/array_constructor_12.f90 -O3 -fomit-frame-pointer (test for excess errors)
WARNING: gfortran.dg/array_constructor_12.f90 -O3 -fomit-frame-pointer compilation failed to produce executable
FAIL: gfortran.dg/array_constructor_12.f90 -O3 -fomit-frame-pointer -funroll-loops (internal compiler error)
FAIL: gfortran.dg/array_constructor_12.f90 -O3 -fomit-frame-pointer -funroll-loops (test for excess errors)
WARNING: gfortran.dg/array_constructor_12.f90 -O3 -fomit-frame-pointer -funroll-loops compilation failed to produce executable
FAIL: gfortran.dg/array_constructor_12.f90 -O3 -fomit-frame-pointer -funroll-all-loops -finline-functions (internal compiler error)
FAIL: gfortran.dg/array_constructor_12.f90 -O3 -fomit-frame-pointer -funroll-all-loops -finline-functions (test for excess errors)
WARNING: gfortran.dg/array_constructor_12.f90 -O3 -fomit-frame-pointer -funroll-all-loops -finline-functions compilation failed to produce executable
FAIL: gfortran.dg/array_constructor_12.f90 -O3 -g (internal compiler error)
FAIL: gfortran.dg/array_constructor_12.f90 -O3 -g (test for excess errors)
WARNING: gfortran.dg/array_constructor_12.f90 -O3 -g compilation failed to produce executable
FAIL: gfortran.dg/array_constructor_12.f90 -Os (internal compiler error)
FAIL: gfortran.dg/array_constructor_12.f90 -Os (test for excess errors)
WARNING: gfortran.dg/array_constructor_12.f90 -Os compilation failed to produce executable
FAIL: gfortran.dg/array_section_1.f90 -O0 (internal compiler error)
FAIL: gfortran.dg/array_section_1.f90 -O0 (test for excess errors)
WARNING: gfortran.dg/array_section_1.f90 -O0 compilation failed to produce executable
FAIL: gfortran.dg/array_section_1.f90 -O1 (internal compiler error)
FAIL: gfortran.dg/array_section_1.f90 -O1 (test for excess errors)
WARNING: gfortran.dg/array_section_1.f90 -O1 compilation failed to produce executable
FAIL: gfortran.dg/array_section_1.f90 -O2 (internal compiler error)
FAIL: gfortran.dg/array_section_1.f90 -O2 (test for excess errors)
WARNING: gfortran.dg/array_section_1.f90 -O2 compilation failed to produce executable
FAIL: gfortran.dg/array_section_1.f90 -O3 -fomit-frame-pointer (internal compiler error)
FAIL: gfortran.dg/array_section_1.f90 -O3 -fomit-frame-pointer (test for excess errors)
WARNING: gfortran.dg/array_section_1.f90 -O3 -fomit-frame-pointer compilation failed to produce executable
FAIL: gfortran.dg/array_section_1.f90 -O3 -fomit-frame-pointer -funroll-loops (internal compiler error)
FAIL: gfortran.dg/array_section_1.f90 -O3 -fomit-frame-pointer -funroll-loops (test for excess errors)
WARNING: gfortran.dg/array_section_1.f90 -O3 -fomit-frame-pointer -funroll-loops compilation failed to produce executable
FAIL: gfortran.dg/array_section_1.f90 -O3 -fomit-frame-pointer -funroll-all-loops -finline-functions (internal compiler error)
FAIL: gfortran.dg/array_section_1.f90 -O3 -fomit-frame-pointer -funroll-all-loops -finline-functions (test for excess errors)
WARNING: gfortran.dg/array_section_1.f90 -O3 -fomit-frame-pointer -funroll-all-loops -finline-functions compilation failed to produce executable
FAIL: gfortran.dg/array_section_1.f90 -O3 -g (internal compiler error)
FAIL: gfortran.dg/array_section_1.f90 -O3 -g (test for excess errors)
WARNING: gfortran.dg/array_section_1.f90 -O3 -g compilation failed to produce executable
FAIL: gfortran.dg/array_section_1.f90 -Os (internal compiler error)
FAIL: gfortran.dg/array_section_1.f90 -Os (test for excess errors)
WARNING: gfortran.dg/array_section_1.f90 -Os compilation failed to produce executable
FAIL: gfortran.dg/assumed_charlen_function_3.f90 -O (internal compiler error)
FAIL: gfortran.dg/assumed_charlen_function_3.f90 -O (test for excess errors)
FAIL: gfortran.dg/assumed_charlen_function_5.f90 -O (internal compiler error)
FAIL: gfortran.dg/assumed_charlen_function_5.f90 -O (test for excess errors)
FAIL: gfortran.dg/char_transpose_1.f90 -O0 (internal compiler error)
FAIL: gfortran.dg/char_transpose_1.f90 -O0 (test for excess errors)
WARNING: gfortran.dg/char_transpose_1.f90 -O0 compilation failed to produce executable
FAIL: gfortran.dg/char_transpose_1.f90 -O1 (internal compiler error)
FAIL: gfortran.dg/char_transpose_1.f90 -O1 (test for excess errors)
WARNING: gfortran.dg/char_transpose_1.f90 -O1 compilation failed to produce executable
FAIL: gfortran.dg/char_transpose_1.f90 -O2 (internal compiler error)
FAIL: gfortran.dg/char_transpose_1.f90 -O2 (test for excess errors)
WARNING: gfortran.dg/char_transpose_1.f90 -O2 compilation failed to produce executable
FAIL: gfortran.dg/char_transpose_1.f90 -O3 -fomit-frame-pointer (internal compiler error)
FAIL: gfortran.dg/char_transpose_1.f90 -O3 -fomit-frame-pointer (test for excess errors)
WARNING: gfortran.dg/char_transpose_1.f90 -O3 -fomit-frame-pointer compilation failed to produce executable
FAIL: gfortran.dg/char_transpose_1.f90 -O3 -fomit-frame-pointer -funroll-loops (internal compiler error)
FAIL: gfortran.dg/char_transpose_1.f90 -O3 -fomit-frame-pointer -funroll-loops (test for excess errors)
WARNING: gfortran.dg/char_transpose_1.f90 -O3 -fomit-frame-pointer -funroll-loops compilation failed to produce executable
FAIL: gfortran.dg/char_transpose_1.f90 -O3 -fomit-frame-pointer -funroll-all-loops -finline-functions (internal compiler error)
FAIL: gfortran.dg/char_transpose_1.f90 -O3 -fomit-frame-pointer -funroll-all-loops -finline-functions (test for excess errors)
WARNING: gfortran.dg/char_transpose_1.f90 -O3 -fomit-frame-pointer -funroll-all-loops -finline-functions compilation failed to produce executable
FAIL: gfortran.dg/char_transpose_1.f90 -O3 -g (internal compiler error)
FAIL: gfortran.dg/char_transpose_1.f90 -O3 -g (test for excess errors)
WARNING: gfortran.dg/char_transpose_1.f90 -O3 -g compilation failed to produce executable
FAIL: gfortran.dg/char_transpose_1.f90 -Os (internal compiler error)
FAIL: gfortran.dg/char_transpose_1.f90 -Os (test for excess errors)
WARNING: gfortran.dg/char_transpose_1.f90 -Os compilation failed to produce executable
FAIL: gfortran.dg/equiv_constraint_4.f90 -O3 -g (internal compiler error)
FAIL: gfortran.dg/equiv_constraint_4.f90 -O3 -g (test for excess errors)
WARNING: gfortran.dg/equiv_constraint_4.f90 -O3 -g compilation failed to produce executable
FAIL: gfortran.dg/hollerith.f90 -O0 (internal compiler error)
FAIL: gfortran.dg/hollerith.f90 -O0 (test for excess errors)
WARNING: gfortran.dg/hollerith.f90 -O0 compilation failed to produce executable
FAIL: gfortran.dg/hollerith.f90 -O1 (internal compiler error)
FAIL: gfortran.dg/hollerith.f90 -O1 (test for excess errors)
WARNING: gfortran.dg/hollerith.f90 -O1 compilation failed to produce executable
FAIL: gfortran.dg/hollerith.f90 -O2 (internal compiler error)
FAIL: gfortran.dg/hollerith.f90 -O2 (test for excess errors)
WARNING: gfortran.dg/hollerith.f90 -O2 compilation failed to produce executable
FAIL: gfortran.dg/hollerith.f90 -O3 -fomit-frame-pointer (internal compiler error)
FAIL: gfortran.dg/hollerith.f90 -O3 -fomit-frame-pointer (test for excess errors)
WARNING: gfortran.dg/hollerith.f90 -O3 -fomit-frame-pointer compilation failed to produce executable
FAIL: gfortran.dg/hollerith.f90 -O3 -fomit-frame-pointer -funroll-loops (internal compiler error)
FAIL: gfortran.dg/hollerith.f90 -O3 -fomit-frame-pointer -funroll-loops (test for excess errors)
WARNING: gfortran.dg/hollerith.f90 -O3 -fomit-frame-pointer -funroll-loops compilation failed to produce executable
FAIL: gfortran.dg/hollerith.f90 -O3 -fomit-frame-pointer -funroll-all-loops -finline-functions (internal compiler error)
FAIL: gfortran.dg/hollerith.f90 -O3 -fomit-frame-pointer -funroll-all-loops -finline-functions (test for excess errors)
WARNING: gfortran.dg/hollerith.f90 -O3 -fomit-frame-pointer -funroll-all-loops -finline-functions compilation failed to produce executable
FAIL: gfortran.dg/hollerith.f90 -O3 -g (internal compiler error)
FAIL: gfortran.dg/hollerith.f90 -O3 -g (test for excess errors)
WARNING: gfortran.dg/hollerith.f90 -O3 -g compilation failed to produce executable
FAIL: gfortran.dg/hollerith.f90 -Os (internal compiler error)
FAIL: gfortran.dg/hollerith.f90 -Os (test for excess errors)
WARNING: gfortran.dg/hollerith.f90 -Os compilation failed to produce executable
FAIL: gfortran.dg/hollerith4.f90 -O0 (internal compiler error)
FAIL: gfortran.dg/hollerith4.f90 -O0 (test for excess errors)
WARNING: gfortran.dg/hollerith4.f90 -O0 compilation failed to produce executable
FAIL: gfortran.dg/hollerith4.f90 -O1 (internal compiler error)
FAIL: gfortran.dg/hollerith4.f90 -O1 (test for excess errors)
WARNING: gfortran.dg/hollerith4.f90 -O1 compilation failed to produce executable
FAIL: gfortran.dg/hollerith4.f90 -O2 (internal compiler error)
FAIL: gfortran.dg/hollerith4.f90 -O2 (test for excess errors)
WARNING: gfortran.dg/hollerith4.f90 -O2 compilation failed to produce executable
FAIL: gfortran.dg/hollerith4.f90 -O3 -fomit-frame-pointer (internal compiler error)
FAIL: gfortran.dg/hollerith4.f90 -O3 -fomit-frame-pointer (test for excess errors)
WARNING: gfortran.dg/hollerith4.f90 -O3 -fomit-frame-pointer compilation failed to produce executable
FAIL: gfortran.dg/hollerith4.f90 -O3 -fomit-frame-pointer -funroll-loops (internal compiler error)
FAIL: gfortran.dg/hollerith4.f90 -O3 -fomit-frame-pointer -funroll-loops (test for excess errors)
WARNING: gfortran.dg/hollerith4.f90 -O3 -fomit-frame-pointer -funroll-loops compilation failed to produce executable
FAIL: gfortran.dg/hollerith4.f90 -O3 -fomit-frame-pointer -funroll-all-loops -finline-functions (internal compiler error)
FAIL: gfortran.dg/hollerith4.f90 -O3 -fomit-frame-pointer -funroll-all-loops -finline-functions (test for excess errors)
WARNING: gfortran.dg/hollerith4.f90 -O3 -fomit-frame-pointer -funroll-all-loops -finline-functions compilation failed to produce executable
FAIL: gfortran.dg/hollerith4.f90 -O3 -g (internal compiler error)
FAIL: gfortran.dg/hollerith4.f90 -O3 -g (test for excess errors)
WARNING: gfortran.dg/hollerith4.f90 -O3 -g compilation failed to produce executable
FAIL: gfortran.dg/hollerith4.f90 -Os (internal compiler error)
FAIL: gfortran.dg/hollerith4.f90 -Os (test for excess errors)
WARNING: gfortran.dg/hollerith4.f90 -Os compilation failed to produce executable
FAIL: gfortran.dg/hollerith_legacy.f90 -O (internal compiler error)
FAIL: gfortran.dg/hollerith_legacy.f90 -O (test for excess errors)
FAIL: gfortran.dg/missing_optional_dummy_2.f90 -O (internal compiler error)
FAIL: gfortran.dg/missing_optional_dummy_2.f90 -O (test for excess errors)
FAIL: gfortran.dg/namelist_13.f90 -O0 (test for excess errors)
FAIL: gfortran.dg/namelist_13.f90 -O1 (test for excess errors)
FAIL: gfortran.dg/namelist_13.f90 -O2 (test for excess errors)
FAIL: gfortran.dg/namelist_13.f90 -O3 -fomit-frame-pointer (test for excess errors)
FAIL: gfortran.dg/namelist_13.f90 -O3 -fomit-frame-pointer -funroll-loops (test for excess errors)
FAIL: gfortran.dg/namelist_13.f90 -O3 -fomit-frame-pointer -funroll-all-loops -finline-functions (test for excess errors)
FAIL: gfortran.dg/namelist_13.f90 -O3 -g (test for excess errors)
FAIL: gfortran.dg/namelist_13.f90 -Os (test for excess errors)
FAIL: gfortran.dg/namelist_14.f90 -O0 (test for excess errors)
FAIL: gfortran.dg/namelist_14.f90 -O0 execution test
FAIL: gfortran.dg/namelist_14.f90 -O1 (test for excess errors)
FAIL: gfortran.dg/namelist_14.f90 -O1 execution test
FAIL: gfortran.dg/namelist_14.f90 -O2 (test for excess errors)
FAIL: gfortran.dg/namelist_14.f90 -O2 execution test
FAIL: gfortran.dg/namelist_14.f90 -O3 -fomit-frame-pointer (test for excess errors)
FAIL: gfortran.dg/namelist_14.f90 -O3 -fomit-frame-pointer execution test
FAIL: gfortran.dg/namelist_14.f90 -O3 -fomit-frame-pointer -funroll-loops (test for excess errors)
FAIL: gfortran.dg/namelist_14.f90 -O3 -fomit-frame-pointer -funroll-loops execution test
FAIL: gfortran.dg/namelist_14.f90 -O3 -fomit-frame-pointer -funroll-all-loops -finline-functions (test for excess errors)
FAIL: gfortran.dg/namelist_14.f90 -O3 -fomit-frame-pointer -funroll-all-loops -finline-functions execution test
FAIL: gfortran.dg/namelist_14.f90 -O3 -g (test for excess errors)
FAIL: gfortran.dg/namelist_14.f90 -O3 -g execution test
FAIL: gfortran.dg/namelist_14.f90 -Os (test for excess errors)
FAIL: gfortran.dg/namelist_14.f90 -Os execution test
FAIL: gfortran.dg/namelist_15.f90 -O0 (test for excess errors)
FAIL: gfortran.dg/namelist_15.f90 -O0 execution test
FAIL: gfortran.dg/namelist_15.f90 -O1 (test for excess errors)
FAIL: gfortran.dg/namelist_15.f90 -O1 execution test
FAIL: gfortran.dg/namelist_15.f90 -O2 (test for excess errors)
FAIL: gfortran.dg/namelist_15.f90 -O2 execution test
FAIL: gfortran.dg/namelist_15.f90 -O3 -fomit-frame-pointer (test for excess errors)
FAIL: gfortran.dg/namelist_15.f90 -O3 -fomit-frame-pointer execution test
FAIL: gfortran.dg/namelist_15.f90 -O3 -fomit-frame-pointer -funroll-loops (test for excess errors)
FAIL: gfortran.dg/namelist_15.f90 -O3 -fomit-frame-pointer -funroll-loops execution test
FAIL: gfortran.dg/namelist_15.f90 -O3 -fomit-frame-pointer -funroll-all-loops -finline-functions (test for excess errors)
FAIL: gfortran.dg/namelist_15.f90 -O3 -fomit-frame-pointer -funroll-all-loops -finline-functions execution test
FAIL: gfortran.dg/namelist_15.f90 -O3 -g (test for excess errors)
FAIL: gfortran.dg/namelist_15.f90 -O3 -g execution test
FAIL: gfortran.dg/namelist_15.f90 -Os (test for excess errors)
FAIL: gfortran.dg/namelist_15.f90 -Os execution test
FAIL: gfortran.dg/optional_assumed_charlen_1.f90 -O (internal compiler error)
FAIL: gfortran.dg/optional_assumed_charlen_1.f90 -O (test for excess errors)
FAIL: gfortran.dg/pr18392.f90 -O0 (test for excess errors)
FAIL: gfortran.dg/pr18392.f90 -O0 execution test
FAIL: gfortran.dg/pr18392.f90 -O1 (test for excess errors)
FAIL: gfortran.dg/pr18392.f90 -O1 execution test
FAIL: gfortran.dg/pr18392.f90 -O2 (test for excess errors)
FAIL: gfortran.dg/pr18392.f90 -O2 execution test
FAIL: gfortran.dg/pr18392.f90 -O3 -fomit-frame-pointer (test for excess errors)
FAIL: gfortran.dg/pr18392.f90 -O3 -fomit-frame-pointer execution test
FAIL: gfortran.dg/pr18392.f90 -O3 -fomit-frame-pointer -funroll-loops (test for excess errors)
FAIL: gfortran.dg/pr18392.f90 -O3 -fomit-frame-pointer -funroll-loops execution test
FAIL: gfortran.dg/pr18392.f90 -O3 -fomit-frame-pointer -funroll-all-loops -finline-functions (test for excess errors)
FAIL: gfortran.dg/pr18392.f90 -O3 -fomit-frame-pointer -funroll-all-loops -finline-functions execution test
FAIL: gfortran.dg/pr18392.f90 -O3 -g (test for excess errors)
FAIL: gfortran.dg/pr18392.f90 -O3 -g execution test
FAIL: gfortran.dg/pr18392.f90 -Os (test for excess errors)
FAIL: gfortran.dg/pr18392.f90 -Os execution test
FAIL: gfortran.dg/pr21177.f90 -O0 (internal compiler error)
FAIL: gfortran.dg/pr21177.f90 -O0 (test for excess errors)
WARNING: gfortran.dg/pr21177.f90 -O0 compilation failed to produce executable
FAIL: gfortran.dg/pr21177.f90 -O1 (internal compiler error)
FAIL: gfortran.dg/pr21177.f90 -O1 (test for excess errors)
WARNING: gfortran.dg/pr21177.f90 -O1 compilation failed to produce executable
FAIL: gfortran.dg/pr21177.f90 -O2 (internal compiler error)
FAIL: gfortran.dg/pr21177.f90 -O2 (test for excess errors)
WARNING: gfortran.dg/pr21177.f90 -O2 compilation failed to produce executable
FAIL: gfortran.dg/pr21177.f90 -O3 -fomit-frame-pointer (internal compiler error)
FAIL: gfortran.dg/pr21177.f90 -O3 -fomit-frame-pointer (test for excess errors)
WARNING: gfortran.dg/pr21177.f90 -O3 -fomit-frame-pointer compilation failed to produce executable
FAIL: gfortran.dg/pr21177.f90 -O3 -fomit-frame-pointer -funroll-loops (internal compiler error)
FAIL: gfortran.dg/pr21177.f90 -O3 -fomit-frame-pointer -funroll-loops (test for excess errors)
WARNING: gfortran.dg/pr21177.f90 -O3 -fomit-frame-pointer -funroll-loops compilation failed to produce executable
FAIL: gfortran.dg/pr21177.f90 -O3 -fomit-frame-pointer -funroll-all-loops -finline-functions (internal compiler error)
FAIL: gfortran.dg/pr21177.f90 -O3 -fomit-frame-pointer -funroll-all-loops -finline-functions (test for excess errors)
WARNING: gfortran.dg/pr21177.f90 -O3 -fomit-frame-pointer -funroll-all-loops -finline-functions compilation failed to produce executable
FAIL: gfortran.dg/pr21177.f90 -O3 -g (internal compiler error)
FAIL: gfortran.dg/pr21177.f90 -O3 -g (test for excess errors)
WARNING: gfortran.dg/pr21177.f90 -O3 -g compilation failed to produce executable
FAIL: gfortran.dg/pr21177.f90 -Os (internal compiler error)
FAIL: gfortran.dg/pr21177.f90 -Os (test for excess errors)
WARNING: gfortran.dg/pr21177.f90 -Os compilation failed to produce executable
FAIL: gfortran.dg/specifics_1.f90 -O0 (internal compiler error)
FAIL: gfortran.dg/specifics_1.f90 -O0 (test for excess errors)
WARNING: gfortran.dg/specifics_1.f90 -O0 compilation failed to produce executable
FAIL: gfortran.dg/specifics_1.f90 -O1 (internal compiler error)
FAIL: gfortran.dg/specifics_1.f90 -O1 (test for excess errors)
WARNING: gfortran.dg/specifics_1.f90 -O1 compilation failed to produce executable
FAIL: gfortran.dg/specifics_1.f90 -O2 (internal compiler error)
FAIL: gfortran.dg/specifics_1.f90 -O2 (test for excess errors)
WARNING: gfortran.dg/specifics_1.f90 -O2 compilation failed to produce executable
FAIL: gfortran.dg/specifics_1.f90 -O3 -fomit-frame-pointer (internal compiler error)
FAIL: gfortran.dg/specifics_1.f90 -O3 -fomit-frame-pointer (test for excess errors)
WARNING: gfortran.dg/specifics_1.f90 -O3 -fomit-frame-pointer compilation failed to produce executable
FAIL: gfortran.dg/specifics_1.f90 -O3 -fomit-frame-pointer -funroll-loops (internal compiler error)
FAIL: gfortran.dg/specifics_1.f90 -O3 -fomit-frame-pointer -funroll-loops (test for excess errors)
WARNING: gfortran.dg/specifics_1.f90 -O3 -fomit-frame-pointer -funroll-loops compilation failed to produce executable
FAIL: gfortran.dg/specifics_1.f90 -O3 -fomit-frame-pointer -funroll-all-loops -finline-functions (internal compiler error)
FAIL: gfortran.dg/specifics_1.f90 -O3 -fomit-frame-pointer -funroll-all-loops -finline-functions (test for excess errors)
WARNING: gfortran.dg/specifics_1.f90 -O3 -fomit-frame-pointer -funroll-all-loops -finline-functions compilation failed to produce executable
FAIL: gfortran.dg/specifics_1.f90 -O3 -g (internal compiler error)
FAIL: gfortran.dg/specifics_1.f90 -O3 -g (test for excess errors)
WARNING: gfortran.dg/specifics_1.f90 -O3 -g compilation failed to produce executable
FAIL: gfortran.dg/specifics_1.f90 -Os (internal compiler error)
FAIL: gfortran.dg/specifics_1.f90 -Os (test for excess errors)
WARNING: gfortran.dg/specifics_1.f90 -Os compilation failed to produce executable
FAIL: gfortran.dg/g77/980628-10.f -O0 execution test
FAIL: gfortran.dg/g77/980628-10.f -O1 execution test
FAIL: gfortran.dg/g77/980628-10.f -O2 execution test
FAIL: gfortran.dg/g77/980628-10.f -O3 -fomit-frame-pointer execution test
FAIL: gfortran.dg/g77/980628-10.f -O3 -fomit-frame-pointer -funroll-loops execution test
FAIL: gfortran.dg/g77/980628-10.f -O3 -fomit-frame-pointer -funroll-all-loops -finline-functions execution test
FAIL: gfortran.dg/g77/980628-10.f -O3 -g execution test
FAIL: gfortran.dg/g77/980628-10.f -Os execution test
FAIL: gfortran.dg/g77/980628-2.f -O0 execution test
FAIL: gfortran.dg/g77/980628-2.f -O1 execution test
FAIL: gfortran.dg/g77/980628-2.f -O2 execution test
FAIL: gfortran.dg/g77/980628-2.f -O3 -fomit-frame-pointer execution test
FAIL: gfortran.dg/g77/980628-2.f -O3 -fomit-frame-pointer -funroll-loops execution test
FAIL: gfortran.dg/g77/980628-2.f -O3 -fomit-frame-pointer -funroll-all-loops -finline-functions execution test
FAIL: gfortran.dg/g77/980628-2.f -O3 -g execution test
FAIL: gfortran.dg/g77/980628-2.f -Os execution test
FAIL: gfortran.dg/g77/980628-3.f -O0 execution test
FAIL: gfortran.dg/g77/980628-3.f -O1 execution test
FAIL: gfortran.dg/g77/980628-3.f -O2 execution test
FAIL: gfortran.dg/g77/980628-3.f -O3 -fomit-frame-pointer execution test
FAIL: gfortran.dg/g77/980628-3.f -O3 -fomit-frame-pointer -funroll-loops execution test
FAIL: gfortran.dg/g77/980628-3.f -O3 -fomit-frame-pointer -funroll-all-loops -finline-functions execution test
FAIL: gfortran.dg/g77/980628-3.f -O3 -g execution test
FAIL: gfortran.dg/g77/980628-3.f -Os execution test
FAIL: gfortran.dg/g77/980628-9.f -O0 execution test
FAIL: gfortran.dg/g77/980628-9.f -O1 execution test
FAIL: gfortran.dg/g77/980628-9.f -O2 execution test
FAIL: gfortran.dg/g77/980628-9.f -O3 -fomit-frame-pointer execution test
FAIL: gfortran.dg/g77/980628-9.f -O3 -fomit-frame-pointer -funroll-loops execution test
FAIL: gfortran.dg/g77/980628-9.f -O3 -fomit-frame-pointer -funroll-all-loops -finline-functions execution test
FAIL: gfortran.dg/g77/980628-9.f -O3 -g execution test
FAIL: gfortran.dg/g77/980628-9.f -Os execution test
FAIL: gfortran.dg/g77/intrinsic-unix-bessel.f -O0 execution test
FAIL: gfortran.dg/g77/intrinsic-unix-bessel.f -O1 execution test
FAIL: gfortran.dg/g77/intrinsic-unix-bessel.f -O2 execution test
FAIL: gfortran.dg/g77/intrinsic-unix-bessel.f -O3 -fomit-frame-pointer execution test
FAIL: gfortran.dg/g77/intrinsic-unix-bessel.f -O3 -fomit-frame-pointer -funroll-loops execution test
FAIL: gfortran.dg/g77/intrinsic-unix-bessel.f -O3 -fomit-frame-pointer -funroll-all-loops -finline-functions execution test
FAIL: gfortran.dg/g77/intrinsic-unix-bessel.f -O3 -g execution test
FAIL: gfortran.dg/g77/intrinsic-unix-bessel.f -Os execution test
FAIL: gfortran.dg/vect/pr19049.f90 -O (test for excess errors)
ERROR: gfortran.dg/vect/pr19049.f90 -O : error executing dg-final: no files matched glob pattern "pr19049.f90.[0-9][0-9][0-9][ti].vect"
UNRESOLVED: gfortran.dg/vect/pr19049.f90 -O : error executing dg-final: no files matched glob pattern "pr19049.f90.[0-9][0-9][0-9][ti].vect"
FAIL: gfortran.dg/vect/vect-1.f90 -O (test for excess errors)
ERROR: gfortran.dg/vect/vect-1.f90 -O : error executing dg-final: no files matched glob pattern "vect-1.f90.[0-9][0-9][0-9][ti].vect"
UNRESOLVED: gfortran.dg/vect/vect-1.f90 -O : error executing dg-final: no files matched glob pattern "vect-1.f90.[0-9][0-9][0-9][ti].vect"
FAIL: gfortran.dg/vect/vect-2.f90 -O (test for excess errors)
ERROR: gfortran.dg/vect/vect-2.f90 -O : error executing dg-final: no files matched glob pattern "vect-2.f90.[0-9][0-9][0-9][ti].vect"
UNRESOLVED: gfortran.dg/vect/vect-2.f90 -O : error executing dg-final: no files matched glob pattern "vect-2.f90.[0-9][0-9][0-9][ti].vect"
FAIL: gfortran.dg/vect/vect-3.f90 -O (test for excess errors)
ERROR: gfortran.dg/vect/vect-3.f90 -O : error executing dg-final: no files matched glob pattern "vect-3.f90.[0-9][0-9][0-9][ti].vect"
UNRESOLVED: gfortran.dg/vect/vect-3.f90 -O : error executing dg-final: no files matched glob pattern "vect-3.f90.[0-9][0-9][0-9][ti].vect"
FAIL: gfortran.dg/vect/vect-4.f90 -O (test for excess errors)
ERROR: gfortran.dg/vect/vect-4.f90 -O : error executing dg-final: no files matched glob pattern "vect-4.f90.[0-9][0-9][0-9][ti].vect"
UNRESOLVED: gfortran.dg/vect/vect-4.f90 -O : error executing dg-final: no files matched glob pattern "vect-4.f90.[0-9][0-9][0-9][ti].vect"
FAIL: gfortran.dg/vect/vect-5.f90 -O (test for excess errors)
WARNING: gfortran.dg/vect/vect-5.f90 -O compilation failed to produce executable
ERROR: gfortran.dg/vect/vect-5.f90 -O : error executing dg-final: no files matched glob pattern "vect-5.f90.[0-9][0-9][0-9][ti].vect"
UNRESOLVED: gfortran.dg/vect/vect-5.f90 -O : error executing dg-final: no files matched glob pattern "vect-5.f90.[0-9][0-9][0-9][ti].vect"
FAIL: gfortran.fortran-torture/execute/equiv_init_1.f90 execution, -O0
FAIL: gfortran.fortran-torture/execute/equiv_init_1.f90 execution, -O1
FAIL: gfortran.fortran-torture/execute/equiv_init_1.f90 execution, -O2
FAIL: gfortran.fortran-torture/execute/equiv_init_1.f90 execution, -O3 -fomit-frame-pointer
FAIL: gfortran.fortran-torture/execute/equiv_init_1.f90 execution, -O3 -fomit-frame-pointer -funroll-loops
FAIL: gfortran.fortran-torture/execute/equiv_init_1.f90 execution, -O3 -fomit-frame-pointer -funroll-all-loops -finline-functions
FAIL: gfortran.fortran-torture/execute/equiv_init_1.f90 execution, -O3 -g
FAIL: gfortran.fortran-torture/execute/equiv_init_1.f90 execution, -Os
FAIL: gfortran.fortran-torture/execute/nullarg.f90, -O0 (internal compiler error)
FAIL: gfortran.fortran-torture/execute/nullarg.f90, -O1 (internal compiler error)
FAIL: gfortran.fortran-torture/execute/nullarg.f90, -O2 (internal compiler error)
FAIL: gfortran.fortran-torture/execute/nullarg.f90, -O3 -fomit-frame-pointer (internal compiler error)
FAIL: gfortran.fortran-torture/execute/nullarg.f90, -O3 -fomit-frame-pointer -funroll-loops (internal compiler error)
FAIL: gfortran.fortran-torture/execute/nullarg.f90, -O3 -fomit-frame-pointer -funroll-all-loops -finline-functions (internal compiler error)
FAIL: gfortran.fortran-torture/execute/nullarg.f90, -O3 -g (internal compiler error)
FAIL: gfortran.fortran-torture/execute/nullarg.f90, -Os (internal compiler error)

    === gfortran Summary for unix/-m32 ===

# of expected passes 15894
# of unexpected failures 260
# of expected failures 6
# of unresolved testcases 6
# of unsupported tests 38

Running target unix/-m64
FAIL: gfortran.dg/aint_anint_1.f90 -O (internal compiler error)
FAIL: gfortran.dg/aint_anint_1.f90 -O (test for excess errors)
FAIL: gfortran.dg/array_constructor_11.f90 -O0 (internal compiler error)
FAIL: gfortran.dg/array_constructor_11.f90 -O0 (test for excess errors)
WARNING: gfortran.dg/array_constructor_11.f90 -O0 compilation failed to produce executable
FAIL: gfortran.dg/array_constructor_11.f90 -O1 (internal compiler error)
FAIL: gfortran.dg/array_constructor_11.f90 -O1 (test for excess errors)
WARNING: gfortran.dg/array_constructor_11.f90 -O1 compilation failed to produce executable
FAIL: gfortran.dg/array_constructor_11.f90 -O2 (internal compiler error)
FAIL: gfortran.dg/array_constructor_11.f90 -O2 (test for excess errors)
WARNING: gfortran.dg/array_constructor_11.f90 -O2 compilation failed to produce executable
FAIL: gfortran.dg/array_constructor_11.f90 -O3 -fomit-frame-pointer (internal compiler error)
FAIL: gfortran.dg/array_constructor_11.f90 -O3 -fomit-frame-pointer (test for excess errors)
WARNING: gfortran.dg/array_constructor_11.f90 -O3 -fomit-frame-pointer compilation failed to produce executable
FAIL: gfortran.dg/array_constructor_11.f90 -O3 -fomit-frame-pointer -funroll-loops (internal compiler error)
FAIL: gfortran.dg/array_constructor_11.f90 -O3 -fomit-frame-pointer -funroll-loops (test for excess errors)
WARNING: gfortran.dg/array_constructor_11.f90 -O3 -fomit-frame-pointer -funroll-loops compilation failed to produce executable
FAIL: gfortran.dg/array_constructor_11.f90 -O3 -fomit-frame-pointer -funroll-all-loops -finline-functions (internal compiler error)
FAIL: gfortran.dg/array_constructor_11.f90 -O3 -fomit-frame-pointer -funroll-all-loops -finline-functions (test for excess errors)
WARNING: gfortran.dg/array_constructor_11.f90 -O3 -fomit-frame-pointer -funroll-all-loops -finline-functions compilation failed to produce executable
FAIL: gfortran.dg/array_constructor_11.f90 -O3 -g (internal compiler error)
FAIL: gfortran.dg/array_constructor_11.f90 -O3 -g (test for excess errors)
WARNING: gfortran.dg/array_constructor_11.f90 -O3 -g compilation failed to produce executable
FAIL: gfortran.dg/array_constructor_11.f90 -Os (internal compiler error)
FAIL: gfortran.dg/array_constructor_11.f90 -Os (test for excess errors)
WARNING: gfortran.dg/array_constructor_11.f90 -Os compilation failed to produce executable
FAIL: gfortran.dg/array_constructor_12.f90 -O0 (internal compiler error)
FAIL: gfortran.dg/array_constructor_12.f90 -O0 (test for excess errors)
WARNING: gfortran.dg/array_constructor_12.f90 -O0 compilation failed to produce executable
FAIL: gfortran.dg/array_constructor_12.f90 -O1 (internal compiler error)
FAIL: gfortran.dg/array_constructor_12.f90 -O1 (test for excess errors)
WARNING: gfortran.dg/array_constructor_12.f90 -O1 compilation failed to produce executable
FAIL: gfortran.dg/array_constructor_12.f90 -O2 (internal compiler error)
FAIL: gfortran.dg/array_constructor_12.f90 -O2 (test for excess errors)
WARNING: gfortran.dg/array_constructor_12.f90 -O2 compilation failed to produce executable
FAIL: gfortran.dg/array_constructor_12.f90 -O3 -fomit-frame-pointer (internal compiler error)
FAIL: gfortran.dg/array_constructor_12.f90 -O3 -fomit-frame-pointer (test for excess errors)
WARNING: gfortran.dg/array_constructor_12.f90 -O3 -fomit-frame-pointer compilation failed to produce executable
FAIL: gfortran.dg/array_constructor_12.f90 -O3 -fomit-frame-pointer -funroll-loops (internal compiler error)
FAIL: gfortran.dg/array_constructor_12.f90 -O3 -fomit-frame-pointer -funroll-loops (test for excess errors)
WARNING: gfortran.dg/array_constructor_12.f90 -O3 -fomit-frame-pointer -funroll-loops compilation failed to produce executable
FAIL: gfortran.dg/array_constructor_12.f90 -O3 -fomit-frame-pointer -funroll-all-loops -finline-functions (internal compiler error)
FAIL: gfortran.dg/array_constructor_12.f90 -O3 -fomit-frame-pointer -funroll-all-loops -finline-functions (test for excess errors)
WARNING: gfortran.dg/array_constructor_12.f90 -O3 -fomit-frame-pointer -funroll-all-loops -finline-functions compilation failed to produce executable
FAIL: gfortran.dg/array_constructor_12.f90 -O3 -g (internal compiler error)
FAIL: gfortran.dg/array_constructor_12.f90 -O3 -g (test for excess errors)
WARNING: gfortran.dg/array_constructor_12.f90 -O3 -g compilation failed to produce executable
FAIL: gfortran.dg/array_constructor_12.f90 -Os (internal compiler error)
FAIL: gfortran.dg/array_constructor_12.f90 -Os (test for excess errors)
WARNING: gfortran.dg/array_constructor_12.f90 -Os compilation failed to produce executable
FAIL: gfortran.dg/array_section_1.f90 -O0 (internal compiler error)
FAIL: gfortran.dg/array_section_1.f90 -O0 (test for excess errors)
WARNING: gfortran.dg/array_section_1.f90 -O0 compilation failed to produce executable
FAIL: gfortran.dg/array_section_1.f90 -O1 (internal compiler error)
FAIL: gfortran.dg/array_section_1.f90 -O1 (test for excess errors)
WARNING: gfortran.dg/array_section_1.f90 -O1 compilation failed to produce executable
FAIL: gfortran.dg/array_section_1.f90 -O2 (internal compiler error)
FAIL: gfortran.dg/array_section_1.f90 -O2 (test for excess errors)
WARNING: gfortran.dg/array_section_1.f90 -O2 compilation failed to produce executable
FAIL: gfortran.dg/array_section_1.f90 -O3 -fomit-frame-pointer (internal compiler error)
FAIL: gfortran.dg/array_section_1.f90 -O3 -fomit-frame-pointer (test for excess errors)
WARNING: gfortran.dg/array_section_1.f90 -O3 -fomit-frame-pointer compilation failed to produce executable
FAIL: gfortran.dg/array_section_1.f90 -O3 -fomit-frame-pointer -funroll-loops (internal compiler error)
FAIL: gfortran.dg/array_section_1.f90 -O3 -fomit-frame-pointer -funroll-loops (test for excess errors)
WARNING: gfortran.dg/array_section_1.f90 -O3 -fomit-frame-pointer -funroll-loops compilation failed to produce executable
FAIL: gfortran.dg/array_section_1.f90 -O3 -fomit-frame-pointer -funroll-all-loops -finline-functions (internal compiler error)
FAIL: gfortran.dg/array_section_1.f90 -O3 -fomit-frame-pointer -funroll-all-loops -finline-functions (test for excess errors)
WARNING: gfortran.dg/array_section_1.f90 -O3 -fomit-frame-pointer -funroll-all-loops -finline-functions compilation failed to produce executable
FAIL: gfortran.dg/array_section_1.f90 -O3 -g (internal compiler error)
FAIL: gfortran.dg/array_section_1.f90 -O3 -g (test for excess errors)
WARNING: gfortran.dg/array_section_1.f90 -O3 -g compilation failed to produce executable
FAIL: gfortran.dg/array_section_1.f90 -Os (internal compiler error)
FAIL: gfortran.dg/array_section_1.f90 -Os (test for excess errors)
WARNING: gfortran.dg/array_section_1.f90 -Os compilation failed to produce executable
FAIL: gfortran.dg/assumed_charlen_function_3.f90 -O (internal compiler error)
FAIL: gfortran.dg/assumed_charlen_function_3.f90 -O (test for excess errors)
FAIL: gfortran.dg/assumed_charlen_function_5.f90 -O (internal compiler error)
FAIL: gfortran.dg/assumed_charlen_function_5.f90 -O (test for excess errors)
FAIL: gfortran.dg/char_transpose_1.f90 -O0 (internal compiler error)
FAIL: gfortran.dg/char_transpose_1.f90 -O0 (test for excess errors)
WARNING: gfortran.dg/char_transpose_1.f90 -O0 compilation failed to produce executable
FAIL: gfortran.dg/char_transpose_1.f90 -O1 (internal compiler error)
FAIL: gfortran.dg/char_transpose_1.f90 -O1 (test for excess errors)
WARNING: gfortran.dg/char_transpose_1.f90 -O1 compilation failed to produce executable
FAIL: gfortran.dg/char_transpose_1.f90 -O2 (internal compiler error)
FAIL: gfortran.dg/char_transpose_1.f90 -O2 (test for excess errors)
WARNING: gfortran.dg/char_transpose_1.f90 -O2 compilation failed to produce executable
FAIL: gfortran.dg/char_transpose_1.f90 -O3 -fomit-frame-pointer (internal compiler error)
FAIL: gfortran.dg/char_transpose_1.f90 -O3 -fomit-frame-pointer (test for excess errors)
WARNING: gfortran.dg/char_transpose_1.f90 -O3 -fomit-frame-pointer compilation failed to produce executable
FAIL: gfortran.dg/char_transpose_1.f90 -O3 -fomit-frame-pointer -funroll-loops (internal compiler error)
FAIL: gfortran.dg/char_transpose_1.f90 -O3 -fomit-frame-pointer -funroll-loops (test for excess errors)
WARNING: gfortran.dg/char_transpose_1.f90 -O3 -fomit-frame-pointer -funroll-loops compilation failed to produce executable
FAIL: gfortran.dg/char_transpose_1.f90 -O3 -fomit-frame-pointer -funroll-all-loops -finline-functions (internal compiler error)
FAIL: gfortran.dg/char_transpose_1.f90 -O3 -fomit-frame-pointer -funroll-all-loops -finline-functions (test for excess errors)
WARNING: gfortran.dg/char_transpose_1.f90 -O3 -fomit-frame-pointer -funroll-all-loops -finline-functions compilation failed to produce executable
FAIL: gfortran.dg/char_transpose_1.f90 -O3 -g (internal compiler error)
FAIL: gfortran.dg/char_transpose_1.f90 -O3 -g (test for excess errors)
WARNING: gfortran.dg/char_transpose_1.f90 -O3 -g compilation failed to produce executable
FAIL: gfortran.dg/char_transpose_1.f90 -Os (internal compiler error)
FAIL: gfortran.dg/char_transpose_1.f90 -Os (test for excess errors)
WARNING: gfortran.dg/char_transpose_1.f90 -Os compilation failed to produce executable
FAIL: gfortran.dg/equiv_constraint_4.f90 -O3 -g (internal compiler error)
FAIL: gfortran.dg/equiv_constraint_4.f90 -O3 -g (test for excess errors)
WARNING: gfortran.dg/equiv_constraint_4.f90 -O3 -g compilation failed to produce executable
FAIL: gfortran.dg/hollerith.f90 -O0 (internal compiler error)
FAIL: gfortran.dg/hollerith.f90 -O0 (test for excess errors)
WARNING: gfortran.dg/hollerith.f90 -O0 compilation failed to produce executable
FAIL: gfortran.dg/hollerith.f90 -O1 (internal compiler error)
FAIL: gfortran.dg/hollerith.f90 -O1 (test for excess errors)
WARNING: gfortran.dg/hollerith.f90 -O1 compilation failed to produce executable
FAIL: gfortran.dg/hollerith.f90 -O2 (internal compiler error)
FAIL: gfortran.dg/hollerith.f90 -O2 (test for excess errors)
WARNING: gfortran.dg/hollerith.f90 -O2 compilation failed to produce executable
FAIL: gfortran.dg/hollerith.f90 -O3 -fomit-frame-pointer (internal compiler error)
FAIL: gfortran.dg/hollerith.f90 -O3 -fomit-frame-pointer (test for excess errors)
WARNING: gfortran.dg/hollerith.f90 -O3 -fomit-frame-pointer compilation failed to produce executable
FAIL: gfortran.dg/hollerith.f90 -O3 -fomit-frame-pointer -funroll-loops (internal compiler error)
FAIL: gfortran.dg/hollerith.f90 -O3 -fomit-frame-pointer -funroll-loops (test for excess errors)
WARNING: gfortran.dg/hollerith.f90 -O3 -fomit-frame-pointer -funroll-loops compilation failed to produce executable
FAIL: gfortran.dg/hollerith.f90 -O3 -fomit-frame-pointer -funroll-all-loops -finline-functions (internal compiler error)
FAIL: gfortran.dg/hollerith.f90 -O3 -fomit-frame-pointer -funroll-all-loops -finline-functions (test for excess errors)
WARNING: gfortran.dg/hollerith.f90 -O3 -fomit-frame-pointer -funroll-all-loops -finline-functions compilation failed to produce executable
FAIL: gfortran.dg/hollerith.f90 -O3 -g (internal compiler error)
FAIL: gfortran.dg/hollerith.f90 -O3 -g (test for excess errors)
WARNING: gfortran.dg/hollerith.f90 -O3 -g compilation failed to produce executable
FAIL: gfortran.dg/hollerith.f90 -Os (internal compiler error)
FAIL: gfortran.dg/hollerith.f90 -Os (test for excess errors)
WARNING: gfortran.dg/hollerith.f90 -Os compilation failed to produce executable
FAIL: gfortran.dg/hollerith4.f90 -O0 (internal compiler error)
FAIL: gfortran.dg/hollerith4.f90 -O0 (test for excess errors)
WARNING: gfortran.dg/hollerith4.f90 -O0 compilation failed to produce executable
FAIL: gfortran.dg/hollerith4.f90 -O1 (internal compiler error)
FAIL: gfortran.dg/hollerith4.f90 -O1 (test for excess errors)
WARNING: gfortran.dg/hollerith4.f90 -O1 compilation failed to produce executable
FAIL: gfortran.dg/hollerith4.f90 -O2 (internal compiler error)
FAIL: gfortran.dg/hollerith4.f90 -O2 (test for excess errors)
WARNING: gfortran.dg/hollerith4.f90 -O2 compilation failed to produce executable
FAIL: gfortran.dg/hollerith4.f90 -O3 -fomit-frame-pointer (internal compiler error)
FAIL: gfortran.dg/hollerith4.f90 -O3 -fomit-frame-pointer (test for excess errors)
WARNING: gfortran.dg/hollerith4.f90 -O3 -fomit-frame-pointer compilation failed to produce executable
FAIL: gfortran.dg/hollerith4.f90 -O3 -fomit-frame-pointer -funroll-loops (internal compiler error)
FAIL: gfortran.dg/hollerith4.f90 -O3 -fomit-frame-pointer -funroll-loops (test for excess errors)
WARNING: gfortran.dg/hollerith4.f90 -O3 -fomit-frame-pointer -funroll-loops compilation failed to produce executable
FAIL: gfortran.dg/hollerith4.f90 -O3 -fomit-frame-pointer -funroll-all-loops -finline-functions (internal compiler error)
FAIL: gfortran.dg/hollerith4.f90 -O3 -fomit-frame-pointer -funroll-all-loops -finline-functions (test for excess errors)
WARNING: gfortran.dg/hollerith4.f90 -O3 -fomit-frame-pointer -funroll-all-loops -finline-functions compilation failed to produce executable
FAIL: gfortran.dg/hollerith4.f90 -O3 -g (internal compiler error)
FAIL: gfortran.dg/hollerith4.f90 -O3 -g (test for excess errors)
WARNING: gfortran.dg/hollerith4.f90 -O3 -g compilation failed to produce executable
FAIL: gfortran.dg/hollerith4.f90 -Os (internal compiler error)
FAIL: gfortran.dg/hollerith4.f90 -Os (test for excess errors)
WARNING: gfortran.dg/hollerith4.f90 -Os compilation failed to produce executable
FAIL: gfortran.dg/hollerith_legacy.f90 -O (internal compiler error)
FAIL: gfortran.dg/hollerith_legacy.f90 -O (test for excess errors)
FAIL: gfortran.dg/large_integer_kind_1.f90 -O0 execution test
FAIL: gfortran.dg/large_integer_kind_1.f90 -O1 execution test
FAIL: gfortran.dg/large_integer_kind_1.f90 -O2 execution test
FAIL: gfortran.dg/large_integer_kind_1.f90 -O3 -fomit-frame-pointer execution test
FAIL: gfortran.dg/large_integer_kind_1.f90 -O3 -fomit-frame-pointer -funroll-loops execution test
FAIL: gfortran.dg/large_integer_kind_1.f90 -O3 -fomit-frame-pointer -funroll-all-loops -finline-functions execution test
FAIL: gfortran.dg/large_integer_kind_1.f90 -O3 -g execution test
FAIL: gfortran.dg/large_integer_kind_1.f90 -Os execution test
FAIL: gfortran.dg/missing_optional_dummy_2.f90 -O (internal compiler error)
FAIL: gfortran.dg/missing_optional_dummy_2.f90 -O (test for excess errors)
FAIL: gfortran.dg/namelist_13.f90 -O0 (test for excess errors)
FAIL: gfortran.dg/namelist_13.f90 -O1 (test for excess errors)
FAIL: gfortran.dg/namelist_13.f90 -O2 (test for excess errors)
FAIL: gfortran.dg/namelist_13.f90 -O3 -fomit-frame-pointer (test for excess errors)
FAIL: gfortran.dg/namelist_13.f90 -O3 -fomit-frame-pointer -funroll-loops (test for excess errors)
FAIL: gfortran.dg/namelist_13.f90 -O3 -fomit-frame-pointer -funroll-all-loops -finline-functions (test for excess errors)
FAIL: gfortran.dg/namelist_13.f90 -O3 -g (test for excess errors)
FAIL: gfortran.dg/namelist_13.f90 -Os (test for excess errors)
FAIL: gfortran.dg/namelist_14.f90 -O0 (test for excess errors)
FAIL: gfortran.dg/namelist_14.f90 -O0 execution test
FAIL: gfortran.dg/namelist_14.f90 -O1 (test for excess errors)
FAIL: gfortran.dg/namelist_14.f90 -O1 execution test
FAIL: gfortran.dg/namelist_14.f90 -O2 (test for excess errors)
FAIL: gfortran.dg/namelist_14.f90 -O2 execution test
FAIL: gfortran.dg/namelist_14.f90 -O3 -fomit-frame-pointer (test for excess errors)
FAIL: gfortran.dg/namelist_14.f90 -O3 -fomit-frame-pointer execution test
FAIL: gfortran.dg/namelist_14.f90 -O3 -fomit-frame-pointer -funroll-loops (test for excess errors)
FAIL: gfortran.dg/namelist_14.f90 -O3 -fomit-frame-pointer -funroll-loops execution test
FAIL: gfortran.dg/namelist_14.f90 -O3 -fomit-frame-pointer -funroll-all-loops -finline-functions (test for excess errors)
FAIL: gfortran.dg/namelist_14.f90 -O3 -fomit-frame-pointer -funroll-all-loops -finline-functions execution test
FAIL: gfortran.dg/namelist_14.f90 -O3 -g (test for excess errors)
FAIL: gfortran.dg/namelist_14.f90 -O3 -g execution test
FAIL: gfortran.dg/namelist_14.f90 -Os (test for excess errors)
FAIL: gfortran.dg/namelist_14.f90 -Os execution test
FAIL: gfortran.dg/namelist_15.f90 -O0 (test for excess errors)
FAIL: gfortran.dg/namelist_15.f90 -O0 execution test
FAIL: gfortran.dg/namelist_15.f90 -O1 (test for excess errors)
FAIL: gfortran.dg/namelist_15.f90 -O1 execution test
FAIL: gfortran.dg/namelist_15.f90 -O2 (test for excess errors)
FAIL: gfortran.dg/namelist_15.f90 -O2 execution test
FAIL: gfortran.dg/namelist_15.f90 -O3 -fomit-frame-pointer (test for excess errors)
FAIL: gfortran.dg/namelist_15.f90 -O3 -fomit-frame-pointer execution test
FAIL: gfortran.dg/namelist_15.f90 -O3 -fomit-frame-pointer -funroll-loops (test for excess errors)
FAIL: gfortran.dg/namelist_15.f90 -O3 -fomit-frame-pointer -funroll-loops execution test
FAIL: gfortran.dg/namelist_15.f90 -O3 -fomit-frame-pointer -funroll-all-loops -finline-functions (test for excess errors)
FAIL: gfortran.dg/namelist_15.f90 -O3 -fomit-frame-pointer -funroll-all-loops -finline-functions execution test
FAIL: gfortran.dg/namelist_15.f90 -O3 -g (test for excess errors)
FAIL: gfortran.dg/namelist_15.f90 -O3 -g execution test
FAIL: gfortran.dg/namelist_15.f90 -Os (test for excess errors)
FAIL: gfortran.dg/namelist_15.f90 -Os execution test
FAIL: gfortran.dg/optional_assumed_charlen_1.f90 -O (internal compiler error)
FAIL: gfortran.dg/optional_assumed_charlen_1.f90 -O (test for excess errors)
FAIL: gfortran.dg/pr18392.f90 -O0 (test for excess errors)
FAIL: gfortran.dg/pr18392.f90 -O0 execution test
FAIL: gfortran.dg/pr18392.f90 -O1 (test for excess errors)
FAIL: gfortran.dg/pr18392.f90 -O1 execution test
FAIL: gfortran.dg/pr18392.f90 -O2 (test for excess errors)
FAIL: gfortran.dg/pr18392.f90 -O2 execution test
FAIL: gfortran.dg/pr18392.f90 -O3 -fomit-frame-pointer (test for excess errors)
FAIL: gfortran.dg/pr18392.f90 -O3 -fomit-frame-pointer execution test
FAIL: gfortran.dg/pr18392.f90 -O3 -fomit-frame-pointer -funroll-loops (test for excess errors)
FAIL: gfortran.dg/pr18392.f90 -O3 -fomit-frame-pointer -funroll-loops execution test
FAIL: gfortran.dg/pr18392.f90 -O3 -fomit-frame-pointer -funroll-all-loops -finline-functions (test for excess errors)
FAIL: gfortran.dg/pr18392.f90 -O3 -fomit-frame-pointer -funroll-all-loops -finline-functions execution test
FAIL: gfortran.dg/pr18392.f90 -O3 -g (test for excess errors)
FAIL: gfortran.dg/pr18392.f90 -O3 -g execution test
FAIL: gfortran.dg/pr18392.f90 -Os (test for excess errors)
FAIL: gfortran.dg/pr18392.f90 -Os execution test
FAIL: gfortran.dg/pr21177.f90 -O0 (internal compiler error)
FAIL: gfortran.dg/pr21177.f90 -O0 (test for excess errors)
WARNING: gfortran.dg/pr21177.f90 -O0 compilation failed to produce executable
FAIL: gfortran.dg/pr21177.f90 -O1 (internal compiler error)
FAIL: gfortran.dg/pr21177.f90 -O1 (test for excess errors)
WARNING: gfortran.dg/pr21177.f90 -O1 compilation failed to produce executable
FAIL: gfortran.dg/pr21177.f90 -O2 (internal compiler error)
FAIL: gfortran.dg/pr21177.f90 -O2 (test for excess errors)
WARNING: gfortran.dg/pr21177.f90 -O2 compilation failed to produce executable
FAIL: gfortran.dg/pr21177.f90 -O3 -fomit-frame-pointer (internal compiler error)
FAIL: gfortran.dg/pr21177.f90 -O3 -fomit-frame-pointer (test for excess errors)
WARNING: gfortran.dg/pr21177.f90 -O3 -fomit-frame-pointer compilation failed to produce executable
FAIL: gfortran.dg/pr21177.f90 -O3 -fomit-frame-pointer -funroll-loops (internal compiler error)
FAIL: gfortran.dg/pr21177.f90 -O3 -fomit-frame-pointer -funroll-loops (test for excess errors)
WARNING: gfortran.dg/pr21177.f90 -O3 -fomit-frame-pointer -funroll-loops compilation failed to produce executable
FAIL: gfortran.dg/pr21177.f90 -O3 -fomit-frame-pointer -funroll-all-loops -finline-functions (internal compiler error)
FAIL: gfortran.dg/pr21177.f90 -O3 -fomit-frame-pointer -funroll-all-loops -finline-functions (test for excess errors)
WARNING: gfortran.dg/pr21177.f90 -O3 -fomit-frame-pointer -funroll-all-loops -finline-functions compilation failed to produce executable
FAIL: gfortran.dg/pr21177.f90 -O3 -g (internal compiler error)
FAIL: gfortran.dg/pr21177.f90 -O3 -g (test for excess errors)
WARNING: gfortran.dg/pr21177.f90 -O3 -g compilation failed to produce executable
FAIL: gfortran.dg/pr21177.f90 -Os (internal compiler error)
FAIL: gfortran.dg/pr21177.f90 -Os (test for excess errors)
WARNING: gfortran.dg/pr21177.f90 -Os compilation failed to produce executable
FAIL: gfortran.dg/specifics_1.f90 -O0 (internal compiler error)
FAIL: gfortran.dg/specifics_1.f90 -O0 (test for excess errors)
WARNING: gfortran.dg/specifics_1.f90 -O0 compilation failed to produce executable
FAIL: gfortran.dg/specifics_1.f90 -O1 (internal compiler error)
FAIL: gfortran.dg/specifics_1.f90 -O1 (test for excess errors)
WARNING: gfortran.dg/specifics_1.f90 -O1 compilation failed to produce executable
FAIL: gfortran.dg/specifics_1.f90 -O2 (internal compiler error)
FAIL: gfortran.dg/specifics_1.f90 -O2 (test for excess errors)
WARNING: gfortran.dg/specifics_1.f90 -O2 compilation failed to produce executable
FAIL: gfortran.dg/specifics_1.f90 -O3 -fomit-frame-pointer (internal compiler error)
FAIL: gfortran.dg/specifics_1.f90 -O3 -fomit-frame-pointer (test for excess errors)
WARNING: gfortran.dg/specifics_1.f90 -O3 -fomit-frame-pointer compilation failed to produce executable
FAIL: gfortran.dg/specifics_1.f90 -O3 -fomit-frame-pointer -funroll-loops (internal compiler error)
FAIL: gfortran.dg/specifics_1.f90 -O3 -fomit-frame-pointer -funroll-loops (test for excess errors)
WARNING: gfortran.dg/specifics_1.f90 -O3 -fomit-frame-pointer -funroll-loops compilation failed to produce executable
FAIL: gfortran.dg/specifics_1.f90 -O3 -fomit-frame-pointer -funroll-all-loops -finline-functions (internal compiler error)
FAIL: gfortran.dg/specifics_1.f90 -O3 -fomit-frame-pointer -funroll-all-loops -finline-functions (test for excess errors)
WARNING: gfortran.dg/specifics_1.f90 -O3 -fomit-frame-pointer -funroll-all-loops -finline-functions compilation failed to produce executable
FAIL: gfortran.dg/specifics_1.f90 -O3 -g (internal compiler error)
FAIL: gfortran.dg/specifics_1.f90 -O3 -g (test for excess errors)
WARNING: gfortran.dg/specifics_1.f90 -O3 -g compilation failed to produce executable
FAIL: gfortran.dg/specifics_1.f90 -Os (internal compiler error)
FAIL: gfortran.dg/specifics_1.f90 -Os (test for excess errors)
WARNING: gfortran.dg/specifics_1.f90 -Os compilation failed to produce executable
FAIL: gfortran.dg/g77/980628-0.f -O0 execution test
FAIL: gfortran.dg/g77/980628-0.f -O1 execution test
FAIL: gfortran.dg/g77/980628-0.f -O2 execution test
FAIL: gfortran.dg/g77/980628-0.f -O3 -fomit-frame-pointer execution test
FAIL: gfortran.dg/g77/980628-0.f -O3 -fomit-frame-pointer -funroll-loops execution test
FAIL: gfortran.dg/g77/980628-0.f -O3 -fomit-frame-pointer -funroll-all-loops -finline-functions execution test
FAIL: gfortran.dg/g77/980628-0.f -O3 -g execution test
FAIL: gfortran.dg/g77/980628-0.f -Os execution test
FAIL: gfortran.dg/g77/980628-1.f -O0 execution test
FAIL: gfortran.dg/g77/980628-1.f -O1 execution test
FAIL: gfortran.dg/g77/980628-1.f -O2 execution test
FAIL: gfortran.dg/g77/980628-1.f -O3 -fomit-frame-pointer execution test
FAIL: gfortran.dg/g77/980628-1.f -O3 -fomit-frame-pointer -funroll-loops execution test
FAIL: gfortran.dg/g77/980628-1.f -O3 -fomit-frame-pointer -funroll-all-loops -finline-functions execution test
FAIL: gfortran.dg/g77/980628-1.f -O3 -g execution test
FAIL: gfortran.dg/g77/980628-1.f -Os execution test
FAIL: gfortran.dg/g77/980628-10.f -O0 execution test
FAIL: gfortran.dg/g77/980628-10.f -O1 execution test
FAIL: gfortran.dg/g77/980628-10.f -O2 execution test
FAIL: gfortran.dg/g77/980628-10.f -O3 -fomit-frame-pointer execution test
FAIL: gfortran.dg/g77/980628-10.f -O3 -fomit-frame-pointer -funroll-loops execution test
FAIL: gfortran.dg/g77/980628-10.f -O3 -fomit-frame-pointer -funroll-all-loops -finline-functions execution test
FAIL: gfortran.dg/g77/980628-10.f -O3 -g execution test
FAIL: gfortran.dg/g77/980628-10.f -Os execution test
FAIL: gfortran.dg/g77/980628-2.f -O0 execution test
FAIL: gfortran.dg/g77/980628-2.f -O1 execution test
FAIL: gfortran.dg/g77/980628-2.f -O2 execution test
FAIL: gfortran.dg/g77/980628-2.f -O3 -fomit-frame-pointer execution test
FAIL: gfortran.dg/g77/980628-2.f -O3 -fomit-frame-pointer -funroll-loops execution test
FAIL: gfortran.dg/g77/980628-2.f -O3 -fomit-frame-pointer -funroll-all-loops -finline-functions execution test
FAIL: gfortran.dg/g77/980628-2.f -O3 -g execution test
FAIL: gfortran.dg/g77/980628-2.f -Os execution test
FAIL: gfortran.dg/g77/980628-3.f -O0 execution test
FAIL: gfortran.dg/g77/980628-3.f -O1 execution test
FAIL: gfortran.dg/g77/980628-3.f -O2 execution test
FAIL: gfortran.dg/g77/980628-3.f -O3 -fomit-frame-pointer execution test
FAIL: gfortran.dg/g77/980628-3.f -O3 -fomit-frame-pointer -funroll-loops execution test
FAIL: gfortran.dg/g77/980628-3.f -O3 -fomit-frame-pointer -funroll-all-loops -finline-functions execution test
FAIL: gfortran.dg/g77/980628-3.f -O3 -g execution test
FAIL: gfortran.dg/g77/980628-3.f -Os execution test
FAIL: gfortran.dg/g77/980628-7.f -O0 execution test
FAIL: gfortran.dg/g77/980628-7.f -O1 execution test
FAIL: gfortran.dg/g77/980628-7.f -O2 execution test
FAIL: gfortran.dg/g77/980628-7.f -O3 -fomit-frame-pointer execution test
FAIL: gfortran.dg/g77/980628-7.f -O3 -fomit-frame-pointer -funroll-loops execution test
FAIL: gfortran.dg/g77/980628-7.f -O3 -fomit-frame-pointer -funroll-all-loops -finline-functions execution test
FAIL: gfortran.dg/g77/980628-7.f -O3 -g execution test
FAIL: gfortran.dg/g77/980628-7.f -Os execution test
FAIL: gfortran.dg/g77/980628-8.f -O0 execution test
FAIL: gfortran.dg/g77/980628-8.f -O1 execution test
FAIL: gfortran.dg/g77/980628-8.f -O2 execution test
FAIL: gfortran.dg/g77/980628-8.f -O3 -fomit-frame-pointer execution test
FAIL: gfortran.dg/g77/980628-8.f -O3 -fomit-frame-pointer -funroll-loops execution test
FAIL: gfortran.dg/g77/980628-8.f -O3 -fomit-frame-pointer -funroll-all-loops -finline-functions execution test
FAIL: gfortran.dg/g77/980628-8.f -O3 -g execution test
FAIL: gfortran.dg/g77/980628-8.f -Os execution test
FAIL: gfortran.dg/g77/980628-9.f -O0 execution test
FAIL: gfortran.dg/g77/980628-9.f -O1 execution test
FAIL: gfortran.dg/g77/980628-9.f -O2 execution test
FAIL: gfortran.dg/g77/980628-9.f -O3 -fomit-frame-pointer execution test
FAIL: gfortran.dg/g77/980628-9.f -O3 -fomit-frame-pointer -funroll-loops execution test
FAIL: gfortran.dg/g77/980628-9.f -O3 -fomit-frame-pointer -funroll-all-loops -finline-functions execution test
FAIL: gfortran.dg/g77/980628-9.f -O3 -g execution test
FAIL: gfortran.dg/g77/980628-9.f -Os execution test
FAIL: gfortran.dg/g77/980701-0.f -O0 execution test
FAIL: gfortran.dg/g77/980701-0.f -O1 execution test
FAIL: gfortran.dg/g77/980701-0.f -O2 execution test
FAIL: gfortran.dg/g77/980701-0.f -O3 -fomit-frame-pointer execution test
FAIL: gfortran.dg/g77/980701-0.f -O3 -fomit-frame-pointer -funroll-loops execution test
FAIL: gfortran.dg/g77/980701-0.f -O3 -fomit-frame-pointer -funroll-all-loops -finline-functions execution test
FAIL: gfortran.dg/g77/980701-0.f -O3 -g execution test
FAIL: gfortran.dg/g77/980701-0.f -Os execution test
FAIL: gfortran.dg/g77/980701-1.f -O0 execution test
FAIL: gfortran.dg/g77/980701-1.f -O1 execution test
FAIL: gfortran.dg/g77/980701-1.f -O2 execution test
FAIL: gfortran.dg/g77/980701-1.f -O3 -fomit-frame-pointer execution test
FAIL: gfortran.dg/g77/980701-1.f -O3 -fomit-frame-pointer -funroll-loops execution test
FAIL: gfortran.dg/g77/980701-1.f -O3 -fomit-frame-pointer -funroll-all-loops -finline-functions execution test
FAIL: gfortran.dg/g77/980701-1.f -O3 -g execution test
FAIL: gfortran.dg/g77/980701-1.f -Os execution test
FAIL: gfortran.dg/vect/pr19049.f90 -O (test for excess errors)
ERROR: gfortran.dg/vect/pr19049.f90 -O : error executing dg-final: no files matched glob pattern "pr19049.f90.[0-9][0-9][0-9][ti].vect"
UNRESOLVED: gfortran.dg/vect/pr19049.f90 -O : error executing dg-final: no files matched glob pattern "pr19049.f90.[0-9][0-9][0-9][ti].vect"
FAIL: gfortran.dg/vect/vect-1.f90 -O (test for excess errors)
ERROR: gfortran.dg/vect/vect-1.f90 -O : error executing dg-final: no files matched glob pattern "vect-1.f90.[0-9][0-9][0-9][ti].vect"
UNRESOLVED: gfortran.dg/vect/vect-1.f90 -O : error executing dg-final: no files matched glob pattern "vect-1.f90.[0-9][0-9][0-9][ti].vect"
FAIL: gfortran.dg/vect/vect-2.f90 -O (test for excess errors)
ERROR: gfortran.dg/vect/vect-2.f90 -O : error executing dg-final: no files matched glob pattern "vect-2.f90.[0-9][0-9][0-9][ti].vect"
UNRESOLVED: gfortran.dg/vect/vect-2.f90 -O : error executing dg-final: no files matched glob pattern "vect-2.f90.[0-9][0-9][0-9][ti].vect"
FAIL: gfortran.dg/vect/vect-3.f90 -O (test for excess errors)
ERROR: gfortran.dg/vect/vect-3.f90 -O : error executing dg-final: no files matched glob pattern "vect-3.f90.[0-9][0-9][0-9][ti].vect"
UNRESOLVED: gfortran.dg/vect/vect-3.f90 -O : error executing dg-final: no files matched glob pattern "vect-3.f90.[0-9][0-9][0-9][ti].vect"
FAIL: gfortran.dg/vect/vect-4.f90 -O (test for excess errors)
ERROR: gfortran.dg/vect/vect-4.f90 -O : error executing dg-final: no files matched glob pattern "vect-4.f90.[0-9][0-9][0-9][ti].vect"
UNRESOLVED: gfortran.dg/vect/vect-4.f90 -O : error executing dg-final: no files matched glob pattern "vect-4.f90.[0-9][0-9][0-9][ti].vect"
FAIL: gfortran.dg/vect/vect-5.f90 -O (test for excess errors)
WARNING: gfortran.dg/vect/vect-5.f90 -O compilation failed to produce executable
ERROR: gfortran.dg/vect/vect-5.f90 -O : error executing dg-final: no files matched glob pattern "vect-5.f90.[0-9][0-9][0-9][ti].vect"
UNRESOLVED: gfortran.dg/vect/vect-5.f90 -O : error executing dg-final: no files matched glob pattern "vect-5.f90.[0-9][0-9][0-9][ti].vect"
FAIL: gfortran.fortran-torture/execute/equiv_init_1.f90 execution, -O0
FAIL: gfortran.fortran-torture/execute/equiv_init_1.f90 execution, -O1
FAIL: gfortran.fortran-torture/execute/equiv_init_1.f90 execution, -O2
FAIL: gfortran.fortran-torture/execute/equiv_init_1.f90 execution, -O3 -fomit-frame-pointer
FAIL: gfortran.fortran-torture/execute/equiv_init_1.f90 execution, -O3 -fomit-frame-pointer -funroll-loops
FAIL: gfortran.fortran-torture/execute/equiv_init_1.f90 execution, -O3 -fomit-frame-pointer -funroll-all-loops -finline-functions
FAIL: gfortran.fortran-torture/execute/equiv_init_1.f90 execution, -O3 -g
FAIL: gfortran.fortran-torture/execute/equiv_init_1.f90 execution, -Os
FAIL: gfortran.fortran-torture/execute/nullarg.f90, -O0 (internal compiler error)
FAIL: gfortran.fortran-torture/execute/nullarg.f90, -O1 (internal compiler error)
FAIL: gfortran.fortran-torture/execute/nullarg.f90, -O2 (internal compiler error)
FAIL: gfortran.fortran-torture/execute/nullarg.f90, -O3 -fomit-frame-pointer (internal compiler error)
FAIL: gfortran.fortran-torture/execute/nullarg.f90, -O3 -fomit-frame-pointer -funroll-loops (internal compiler error)
FAIL: gfortran.fortran-torture/execute/nullarg.f90, -O3 -fomit-frame-pointer -funroll-all-loops -finline-functions (internal compiler error)
FAIL: gfortran.fortran-torture/execute/nullarg.f90, -O3 -g (internal compiler error)
FAIL: gfortran.fortran-torture/execute/nullarg.f90, -Os (internal compiler error)

    === gfortran Summary for unix/-m64 ===

# of expected passes 15845
# of unexpected failures 308
# of expected failures 6
# of unresolved testcases 6
# of unsupported tests 39

    === gfortran Summary ===

# of expected passes 31739
# of unexpected failures 568
# of expected failures 12
# of unresolved testcases 12
# of unsupported tests 77
/sw/src/fink.build/llvm-gcc42-2.5-1/llvm_gcc42_objdir/gcc/testsuite/gfortran/../../gfortran version 4.2.1 (Based on Apple Inc. build 5636) (LLVM build)

Compiler version: 4.2.1 (Based on Apple Inc. build 5636) (LLVM build) gfortran
Platform: i686-apple-darwin9
configure flags: --prefix=/sw --prefix=/sw/lib/llvm-gcc-4.2 --mandir=/sw/share/man --infodir=/sw/share/info --with-gmp=/sw --with-libiconv-prefix=/usr --with-system-zlib --with-as=/Developer/usr/bin/as --with-ld=/Developer/usr/bin/ld --with-nm=/Developer/usr/bin/nm --build=i686-apple-darwin9 --target=i686-apple-darwin9 --host=i686-apple-darwin9 --with-arch=nocona --with-tune=generic --with-gxx-include-dir=/usr/include/c++/4.0.0 --enable-llvm=/sw/src/fink.build/llvm-gcc42-2.5-1/llvm-2.5/../llvm_objdir --enable-languages=c,c++,fortran

The current llvm/llvm-gcc4.2 svn is now fixed with
respect to the extra warnings that were being emitted
by the gfortran compiler. The gfortran testsuite results
under Intel Darwin9 are appended below.

Yay! Thanks for testing this out.

Native configuration is i686-apple-darwin9

               === gfortran tests ===

               === gfortran Summary for unix/-m32 ===

# of expected passes 15894
# of unexpected failures 260
# of expected failures 6
# of unresolved testcases 6
# of unsupported tests 38

Running target unix/-m64
               === gfortran Summary for unix/-m64 ===

# of expected passes 15845
# of unexpected failures 308
# of expected failures 6
# of unresolved testcases 6
# of unsupported tests 39

               === gfortran Summary ===

# of expected passes 31739
# of unexpected failures 568
# of expected failures 12
# of unresolved testcases 12
# of unsupported tests 77

For a first swipe, this probably isn't *too* terrible. Could you start
filing bugs for the ICEs?

-bw

For the 2.5 release, I think we're most interested in establishing a baseline. 2 days before the release branch isn't the time where we really want to fix all the bugs. However, non-invasive bug fixes are always welcome of course. :slight_smile:

-Chris

Quite true! I wasn't thinking of fixing all of the ICEs within the
next 2 days. :wink:

-bw

For the 2.5 release, I think we're most interested in establishing a
baseline. 2 days before the release branch isn't the time where we
really want to fix all the bugs. However, non-invasive bug fixes are
always welcome of course. :slight_smile:

Most of all test fails are, unfortunately, due to weirdness of the
frontend, since it generates bogus decls (e.g. function decl without
any arguments, only with return type and later create the 'full'
definition). I introduced some workaround for this in the past, but it
seems, it's not enough for this purposes. The problem is not even
resolved in gcc mainline yet. See gcc PR33097 for more information.

There are surely other bugs, but the ones related to mentioned PR are
the majority.

I'd suggest also to run polyhedron & SPEC. They should be more or less
fine (at least, they were on linux at 2.4 times).