llvm no build?

llvm no build?

llvm/llvm/lib/Target/PIC16/PIC16AsmPrinter.cpp: In member function ‘bool llvm::PIC16AsmPrinter::printMachineInstruction(const llvm::MachineInstr*)’:
llvm/lib/Target/PIC16/PIC16AsmPrinter.cpp:80: error: ‘CurBank’ was not declared in this scope
llvm/lib/Target/PIC16/PIC16AsmPrinter.cpp: In member function ‘virtual bool llvm::PIC16AsmPrinter::runOnMachineFunction(llvm::MachineFunction&)’:
llvm/lib/Target/PIC16/PIC16AsmPrinter.cpp:125: error: ‘CurBank’ was not declared in this scope
make: *** [/Volumes/mrs5/net/llvm/llvm-build/lib/Target/PIC16/Debug/PIC16AsmPrinter.o] Error 1

?

Mike Stump wrote:

llvm no build?

llvm/llvm/lib/Target/PIC16/PIC16AsmPrinter.cpp: In member function ‘bool llvm::PIC16AsmPrinter::printMachineInstruction(const llvm::MachineInstr*)’:
llvm/lib/Target/PIC16/PIC16AsmPrinter.cpp:80: error: ‘CurBank’ was not declared in this scope
llvm/lib/Target/PIC16/PIC16AsmPrinter.cpp: In member function ‘virtual bool llvm::PIC16AsmPrinter::runOnMachineFunction (llvm::MachineFunction&)’:
llvm/lib/Target/PIC16/PIC16AsmPrinter.cpp:125: error: ‘CurBank’ was not declared in this scope
make: *** [/Volumes/mrs5/net/llvm/llvm-build/lib/Target/PIC16/Debug/ PIC16AsmPrinter.o] Error 1

Yeah, I see it too. It's r66761.

Sanjiv, are you taking a look at this?

FYI, if you see obvious build breakage like this, please revert the patch immediately.

-Chris