Llvm-14.0.6 build fails in configure phase

Dear all,

LLVM-14.0.6 compilation fails in configure phase itself with below error.
{{
{{
– Performing Test HAS_WERROR_GLOBAL_CTORS - Failed
– Found Git: /usr/bin/git (found version “2.37.3”)
– Targeting X86
CMake Error at cmake/modules/CMakeLists.txt:1 (include):
include could not find requested file:

ExtendPath

CMake Error at cmake/modules/CMakeLists.txt:3 (include):
include could not find requested file:

FindPrefixFromConfig

CMake Error at cmake/modules/CMakeLists.txt:113 (find_prefix_from_config):
Unknown CMake command “find_prefix_from_config”.

– Configuring incomplete, errors occurred!
}}
Similar error is discussed in CMake Error at cmake/modules/CMakeLists.txt · Issue #53281 · llvm/llvm-project · GitHub and proposed below patch as Fix.
Add cmake/ to release tarballs via concatenation · PBHDK/llvm-project@4959d29 · GitHub

llvm-14.0.6 version contains the above fix but still issue is observed even after inclusion of above fix patch.
I observed llvm-15.0.0 compilation also fails with above configure error .
Please let me know workaround/input to fix the failure?

Regards
Koti

Can you test this on 15.0.0 and post the full cmake invocation and the full error?

Dear tobiashieta
I am not allowed to upload text file with cmake invocation error details.
Hence i posted it here.
Please find the details given below.
{{

host-llvm 15.0.0 Extracting
xzcat /home/koti/buildroot-desktop/buildroot/dl/llvm/llvm-15.0.0.src.tar.xz | /home/koti/buildroot-desktop/buildroot/output/host/bin/tar --strip-components=1 -C /home/koti/buildroot-desktop/buildroot/output/build/host-llvm-15.0.0 -xf -
host-llvm 15.0.0 Patching
host-llvm 15.0.0 Configuring
(mkdir -p /home/koti/buildroot-desktop/buildroot/output/build/host-llvm-15.0.0//buildroot-build && cd /home/koti/buildroot-desktop/buildroot/output/build/host-llvm-15.0.0//buildroot-build && rm -f CMakeCache.txt && PATH=“/home/koti/buildroot-desktop/buildroot/output/host/bin:/home/koti/buildroot-desktop/buildroot/output/host/sbin:/home/koti/.local/bin:/home/koti/.local/bin:/home/koti/.local/bin:/home/koti/.local/bin:/home/koti/.local/bin:/usr/local/sbin:/usr/local/bin:/usr/sbin:/usr/bin:/sbin:/bin:/usr/games:/usr/local/games:/snap/bin” PKG_CONFIG=“/home/koti/buildroot-desktop/buildroot/output/host/bin/pkg-config” PKG_CONFIG_SYSROOT_DIR=“/” PKG_CONFIG_LIBDIR=“/home/koti/buildroot-desktop/buildroot/output/host/lib/pkgconfig:/home/koti/buildroot-desktop/buildroot/output/host/share/pkgconfig” PKG_CONFIG_ALLOW_SYSTEM_CFLAGS=1 PKG_CONFIG_ALLOW_SYSTEM_LIBS=1 /usr/bin/cmake /home/koti/buildroot-desktop/buildroot/output/build/host-llvm-15.0.0/ -DCMAKE_INSTALL_SO_NO_EXE=0 -DCMAKE_FIND_ROOT_PATH=“/home/koti/buildroot-desktop/buildroot/output/host” -DCMAKE_FIND_ROOT_PATH_MODE_PROGRAM=“BOTH” -DCMAKE_FIND_ROOT_PATH_MODE_LIBRARY=“BOTH” -DCMAKE_FIND_ROOT_PATH_MODE_INCLUDE=“BOTH” -DCMAKE_INSTALL_PREFIX=“/home/koti/buildroot-desktop/buildroot/output/host” -DCMAKE_C_FLAGS=“-O2 -I/home/koti/buildroot-desktop/buildroot/output/host/include” -DCMAKE_CXX_FLAGS=“-O2 -I/home/koti/buildroot-desktop/buildroot/output/host/include” -DCMAKE_EXE_LINKER_FLAGS=“-L/home/koti/buildroot-desktop/buildroot/output/host/lib -Wl,-rpath,/home/koti/buildroot-desktop/buildroot/output/host/lib” -DCMAKE_SHARED_LINKER_FLAGS=“-L/home/koti/buildroot-desktop/buildroot/output/host/lib -Wl,-rpath,/home/koti/buildroot-desktop/buildroot/output/host/lib” -DCMAKE_ASM_COMPILER=“/usr/bin/as” -DCMAKE_C_COMPILER=“/usr/bin/gcc” -DCMAKE_CXX_COMPILER=“/usr/bin/g++” -DCMAKE_C_COMPILER_ARG1=“” -DCMAKE_CXX_COMPILER_ARG1=“” -DCMAKE_COLOR_MAKEFILE=OFF -DBUILD_DOC=OFF -DBUILD_DOCS=OFF -DBUILD_EXAMPLE=OFF -DBUILD_EXAMPLES=OFF -DBUILD_TEST=OFF -DBUILD_TESTS=OFF -DBUILD_TESTING=OFF -DLLVM_TEMPORARILY_ALLOW_OLD_TOOLCHAIN=ON -DLLVM_ENABLE_PROJECTS=“” -DLLVM_CCACHE_BUILD=OFF -DCMAKE_INSTALL_RPATH=“/home/koti/buildroot-desktop/buildroot/output/host/lib” -DLLVM_TARGETS_TO_BUILD=“X86” -DLLVM_TARGET_ARCH=X86 -DBUILD_SHARED_LIBS=OFF -DLLVM_BUILD_LLVM_DYLIB=ON -DLLVM_LINK_LLVM_DYLIB=ON -DLLVM_ENABLE_LIBEDIT=OFF -DLLVM_INSTALL_TOOLCHAIN_ONLY=OFF -DLLVM_APPEND_VC_REV=OFF -DLLVM_ENABLE_BACKTRACES=OFF -DENABLE_CRASH_OVERRIDES=ON -DLLVM_ENABLE_FFI=OFF -DLLVM_ENABLE_TERMINFO=OFF -DLLVM_ENABLE_THREADS=ON -DLLVM_ENABLE_ZLIB=ON -DLLVM_ENABLE_LIBXML2=OFF -DLLVM_ENABLE_Z3_SOLVER=OFF -DLLVM_ENABLE_PIC=ON -DCMAKE_BUILD_TYPE=Release -DLLVM_ENABLE_CXX1Y=OFF -DLLVM_ENABLE_CXX1Z=OFF -DLLVM_ENABLE_MODULES=OFF -DLLVM_ENABLE_MODULE_DEBUGGING=OFF -DLLVM_ENABLE_LIBCXX=OFF -DLLVM_ENABLE_LLD=OFF -DLLVM_DEFAULT_TARGET_TRIPLE=x86_64-buildroot-linux-uclibc -DLLVM_ENABLE_BINDINGS=OFF -DLLVM_OPTIMIZED_TABLEGEN=ON -DLLVM_BUILD_UTILS=ON -DLLVM_INCLUDE_UTILS=ON -DLLVM_INSTALL_UTILS=ON -DLLVM_INCLUDE_TOOLS=ON -DLLVM_BUILD_TOOLS=ON -DLLVM_ENABLE_RTTI=OFF -DLLVM_BUILD_EXTERNAL_COMPILER_RT=OFF -DLLVM_BUILD_RUNTIME=OFF -DLLVM_INCLUDE_RUNTIMES=OFF -DLLVM_POLLY_BUILD=OFF -DLLVM_ENABLE_WARNINGS=ON -DLLVM_ENABLE_PEDANTIC=ON -DLLVM_ENABLE_WERROR=OFF -DLLVM_BUILD_EXAMPLES=OFF -DLLVM_BUILD_DOCS=OFF -DLLVM_BUILD_TESTS=OFF -DLLVM_ENABLE_DOXYGEN=OFF -DLLVM_ENABLE_OCAMLDOC=OFF -DLLVM_ENABLE_SPHINX=OFF -DLLVM_INCLUDE_EXAMPLES=OFF -DLLVM_INCLUDE_DOCS=OFF -DLLVM_INCLUDE_GO_TESTS=OFF -DLLVM_INCLUDE_TESTS=OFF )
– The C compiler identification is GNU 11.2.0
– The CXX compiler identification is GNU 11.2.0
– The ASM compiler identification is GNU
– Found assembler: /usr/bin/as
– Detecting C compiler ABI info
– Detecting C compiler ABI info - done
– Check for working C compiler: /usr/bin/gcc - skipped
– Detecting C compile features
– Detecting C compile features - done
– Detecting CXX compiler ABI info
– Detecting CXX compiler ABI info - done
– Check for working CXX compiler: /usr/bin/g++ - skipped
– Detecting CXX compile features
– Detecting CXX compile features - done
CMake Error at CMakeLists.txt:327 (include):
include could not find requested file:

GNUInstallPackageDir

– Looking for dlfcn.h
– Looking for dlfcn.h - found
– Looking for errno.h
– Looking for errno.h - found
– Looking for fcntl.h
– Looking for fcntl.h - found
– Looking for link.h
– Looking for link.h - found
– Looking for malloc/malloc.h
– Looking for malloc/malloc.h - not found
– Looking for pthread.h
– Looking for pthread.h - found
– Looking for signal.h
– Looking for signal.h - found
– Looking for sys/ioctl.h
– Looking for sys/ioctl.h - found
– Looking for sys/mman.h
– Looking for sys/mman.h - found
– Looking for sys/param.h
– Looking for sys/param.h - found
– Looking for sys/resource.h
– Looking for sys/resource.h - found
– Looking for sys/stat.h
– Looking for sys/stat.h - found
– Looking for sys/time.h
– Looking for sys/time.h - found
– Looking for sys/types.h
– Looking for sys/types.h - found
– Looking for sysexits.h
– Looking for sysexits.h - found
– Looking for termios.h
– Looking for termios.h - found
– Looking for unistd.h
– Looking for unistd.h - found
– Looking for valgrind/valgrind.h
– Looking for valgrind/valgrind.h - not found
– Looking for fenv.h
– Looking for fenv.h - found
– Looking for FE_ALL_EXCEPT
– Looking for FE_ALL_EXCEPT - found
– Looking for FE_INEXACT
– Looking for FE_INEXACT - found
– Looking for mach/mach.h
– Looking for mach/mach.h - not found
– Looking for CrashReporterClient.h
– Looking for CrashReporterClient.h - not found
– Looking for linux/magic.h
– Looking for linux/magic.h - found
– Looking for pthread_create in pthread
– Looking for pthread_create in pthread - found
– Looking for pthread_rwlock_init in pthread
– Looking for pthread_rwlock_init in pthread - found
– Looking for pthread_mutex_lock in pthread
– Looking for pthread_mutex_lock in pthread - found
– Looking for dlopen in dl
– Looking for dlopen in dl - found
– Looking for clock_gettime in rt
– Looking for clock_gettime in rt - found
– Looking for pfm_initialize in pfm
– Looking for pfm_initialize in pfm - not found
– Looking for pthread.h
– Looking for pthread.h - found
– Performing Test CMAKE_HAVE_LIBC_PTHREAD
– Performing Test CMAKE_HAVE_LIBC_PTHREAD - Success
– Found Threads: TRUE
– Found ZLIB: /home/koti/buildroot-desktop/buildroot/output/host/usr/lib/libz.so (found version “1.2.11”)
– Looking for compress2
– Looking for compress2 - found
– Looking for xar_open in xar
– Looking for xar_open in xar - not found
– Looking for arc4random
– Looking for arc4random - not found
– Looking for backtrace
– Looking for backtrace - found
– backtrace facility detected in default set of libraries
– Found Backtrace: /usr/include
– Performing Test C_SUPPORTS_WERROR_UNGUARDED_AVAILABILITY_NEW
– Performing Test C_SUPPORTS_WERROR_UNGUARDED_AVAILABILITY_NEW - Failed
– Looking for __register_frame
– Looking for __register_frame - found
– Looking for __deregister_frame
– Looking for __deregister_frame - found
– Looking for __unw_add_dynamic_fde
– Looking for __unw_add_dynamic_fde - not found
– Looking for _Unwind_Backtrace
– Looking for _Unwind_Backtrace - found
– Looking for getpagesize
– Looking for getpagesize - found
– Looking for sysconf
– Looking for sysconf - found
– Looking for getrusage
– Looking for getrusage - found
– Looking for setrlimit
– Looking for setrlimit - found
– Looking for isatty
– Looking for isatty - found
– Looking for futimens
– Looking for futimens - found
– Looking for futimes
– Looking for futimes - found
– Looking for sigaltstack
– Looking for sigaltstack - found
– Looking for lseek64
– Looking for lseek64 - found
– Looking for mallctl
– Looking for mallctl - not found
– Looking for mallinfo
– Looking for mallinfo - found
– Looking for mallinfo2
– Looking for mallinfo2 - found
– Looking for malloc_zone_statistics
– Looking for malloc_zone_statistics - not found
– Looking for getrlimit
– Looking for getrlimit - found
– Looking for posix_spawn
– Looking for posix_spawn - found
– Looking for pread
– Looking for pread - found
– Looking for sbrk
– Looking for sbrk - found
– Looking for strerror
– Looking for strerror - found
– Looking for strerror_r
– Looking for strerror_r - found
– Looking for strerror_s
– Looking for strerror_s - not found
– Looking for setenv
– Looking for setenv - found
– Looking for dlopen
– Looking for dlopen - found
– Looking for dladdr
– Looking for dladdr - not found
– Performing Test HAVE_STRUCT_STAT_ST_MTIMESPEC_TV_NSEC
– Performing Test HAVE_STRUCT_STAT_ST_MTIMESPEC_TV_NSEC - Failed
– Performing Test HAVE_STRUCT_STAT_ST_MTIM_TV_NSEC
– Performing Test HAVE_STRUCT_STAT_ST_MTIM_TV_NSEC - Success
– Looking for GLIBC
– Looking for GLIBC - found
– Looking for pthread_getname_np
– Looking for pthread_getname_np - found
– Looking for pthread_setname_np
– Looking for pthread_setname_np - found
– Looking for proc_pid_rusage
– Looking for proc_pid_rusage - not found
– Performing Test HAVE_STD_IS_TRIVIALLY_COPYABLE
– Performing Test HAVE_STD_IS_TRIVIALLY_COPYABLE - Success
– Performing Test HAVE_CXX_ATOMICS_WITHOUT_LIB
– Performing Test HAVE_CXX_ATOMICS_WITHOUT_LIB - Success
– Performing Test HAVE_CXX_ATOMICS64_WITHOUT_LIB
– Performing Test HAVE_CXX_ATOMICS64_WITHOUT_LIB - Success
– Performing Test LLVM_HAS_ATOMICS
– Performing Test LLVM_HAS_ATOMICS - Success
– Performing Test SUPPORTS_VARIADIC_MACROS_FLAG
– Performing Test SUPPORTS_VARIADIC_MACROS_FLAG - Success
– Performing Test SUPPORTS_GNU_ZERO_VARIADIC_MACRO_ARGUMENTS_FLAG
– Performing Test SUPPORTS_GNU_ZERO_VARIADIC_MACRO_ARGUMENTS_FLAG - Failed
– Performing Test HAS_MAYBE_UNINITIALIZED
– Performing Test HAS_MAYBE_UNINITIALIZED - Success
– Native target architecture is X86
– Threads enabled.
– Doxygen disabled.
– Go bindings disabled.
– Could NOT find OCaml (missing: OCAMLFIND OCAML_VERSION OCAML_STDLIB_PATH)
– OCaml bindings disabled.
– Could NOT find Python module pygments
– Could NOT find Python module pygments.lexers.c_cpp
– Could NOT find Python module yaml
– LLVM host triple: x86_64-unknown-linux-gnu
– LLVM default target triple: x86_64-buildroot-linux-uclibc
– Performing Test C_SUPPORTS_FPIC
– Performing Test C_SUPPORTS_FPIC - Success
– Performing Test CXX_SUPPORTS_FPIC
– Performing Test CXX_SUPPORTS_FPIC - Success
– Building with -fPIC
– Performing Test C_SUPPORTS_FNO_SEMANTIC_INTERPOSITION
– Performing Test C_SUPPORTS_FNO_SEMANTIC_INTERPOSITION - Success
– Performing Test CXX_SUPPORTS_FNO_SEMANTIC_INTERPOSITION
– Performing Test CXX_SUPPORTS_FNO_SEMANTIC_INTERPOSITION - Success
– Performing Test SUPPORTS_FVISIBILITY_INLINES_HIDDEN_FLAG
– Performing Test SUPPORTS_FVISIBILITY_INLINES_HIDDEN_FLAG - Success
– Performing Test C_SUPPORTS_WERROR_DATE_TIME
– Performing Test C_SUPPORTS_WERROR_DATE_TIME - Success
– Performing Test CXX_SUPPORTS_WERROR_DATE_TIME
– Performing Test CXX_SUPPORTS_WERROR_DATE_TIME - Success
– Performing Test CXX_SUPPORTS_WERROR_UNGUARDED_AVAILABILITY_NEW
– Performing Test CXX_SUPPORTS_WERROR_UNGUARDED_AVAILABILITY_NEW - Failed
– Performing Test CXX_SUPPORTS_MISSING_FIELD_INITIALIZERS_FLAG
– Performing Test CXX_SUPPORTS_MISSING_FIELD_INITIALIZERS_FLAG - Success
– Performing Test C_SUPPORTS_CXX98_COMPAT_EXTRA_SEMI_FLAG
– Performing Test C_SUPPORTS_CXX98_COMPAT_EXTRA_SEMI_FLAG - Failed
– Performing Test CXX_SUPPORTS_CXX98_COMPAT_EXTRA_SEMI_FLAG
– Performing Test CXX_SUPPORTS_CXX98_COMPAT_EXTRA_SEMI_FLAG - Failed
– Performing Test C_SUPPORTS_IMPLICIT_FALLTHROUGH_FLAG
– Performing Test C_SUPPORTS_IMPLICIT_FALLTHROUGH_FLAG - Success
– Performing Test CXX_SUPPORTS_IMPLICIT_FALLTHROUGH_FLAG
– Performing Test CXX_SUPPORTS_IMPLICIT_FALLTHROUGH_FLAG - Success
– Performing Test C_SUPPORTS_COVERED_SWITCH_DEFAULT_FLAG
– Performing Test C_SUPPORTS_COVERED_SWITCH_DEFAULT_FLAG - Failed
– Performing Test CXX_SUPPORTS_COVERED_SWITCH_DEFAULT_FLAG
– Performing Test CXX_SUPPORTS_COVERED_SWITCH_DEFAULT_FLAG - Failed
– Performing Test CXX_SUPPORTS_CLASS_MEMACCESS_FLAG
– Performing Test CXX_SUPPORTS_CLASS_MEMACCESS_FLAG - Success
– Performing Test CXX_SUPPORTS_REDUNDANT_MOVE_FLAG
– Performing Test CXX_SUPPORTS_REDUNDANT_MOVE_FLAG - Success
– Performing Test CXX_SUPPORTS_PESSIMIZING_MOVE_FLAG
– Performing Test CXX_SUPPORTS_PESSIMIZING_MOVE_FLAG - Success
– Performing Test CXX_SUPPORTS_NOEXCEPT_TYPE_FLAG
– Performing Test CXX_SUPPORTS_NOEXCEPT_TYPE_FLAG - Success
– Performing Test CXX_WONT_WARN_ON_FINAL_NONVIRTUALDTOR
– Performing Test CXX_WONT_WARN_ON_FINAL_NONVIRTUALDTOR - Failed
– Performing Test CXX_SUPPORTS_SUGGEST_OVERRIDE_FLAG
– Performing Test CXX_SUPPORTS_SUGGEST_OVERRIDE_FLAG - Success
– Performing Test CXX_WSUGGEST_OVERRIDE_ALLOWS_ONLY_FINAL
– Performing Test CXX_WSUGGEST_OVERRIDE_ALLOWS_ONLY_FINAL - Success
– Performing Test C_WCOMMENT_ALLOWS_LINE_WRAP
– Performing Test C_WCOMMENT_ALLOWS_LINE_WRAP - Failed
– Performing Test C_SUPPORTS_STRING_CONVERSION_FLAG
– Performing Test C_SUPPORTS_STRING_CONVERSION_FLAG - Failed
– Performing Test CXX_SUPPORTS_STRING_CONVERSION_FLAG
– Performing Test CXX_SUPPORTS_STRING_CONVERSION_FLAG - Failed
– Performing Test C_SUPPORTS_MISLEADING_INDENTATION_FLAG
– Performing Test C_SUPPORTS_MISLEADING_INDENTATION_FLAG - Success
– Performing Test CXX_SUPPORTS_MISLEADING_INDENTATION_FLAG
– Performing Test CXX_SUPPORTS_MISLEADING_INDENTATION_FLAG - Success
– Performing Test C_SUPPORTS_FNO_FUNCTION_SECTIONS
– Performing Test C_SUPPORTS_FNO_FUNCTION_SECTIONS - Success
– Performing Test C_SUPPORTS_FFUNCTION_SECTIONS
– Performing Test C_SUPPORTS_FFUNCTION_SECTIONS - Success
– Performing Test CXX_SUPPORTS_FFUNCTION_SECTIONS
– Performing Test CXX_SUPPORTS_FFUNCTION_SECTIONS - Success
– Performing Test C_SUPPORTS_FDATA_SECTIONS
– Performing Test C_SUPPORTS_FDATA_SECTIONS - Success
– Performing Test CXX_SUPPORTS_FDATA_SECTIONS
– Performing Test CXX_SUPPORTS_FDATA_SECTIONS - Success
– Looking for os_signpost_interval_begin
– Looking for os_signpost_interval_begin - not found
– Found Python3: /usr/bin/python3.10 (found suitable version “3.10.4”, minimum required is “3.0”) found components: Interpreter
– Linker detection: GNU ld
– Performing Test HAS_WERROR_GLOBAL_CTORS
– Performing Test HAS_WERROR_GLOBAL_CTORS - Failed
– Looking for x86_64
– Looking for x86_64 - found
– Found Git: /usr/bin/git (found version “2.37.3”)
– Targeting X86
CMake Error at cmake/modules/CMakeLists.txt:1 (include):
include could not find requested file:

ExtendPath

CMake Error at cmake/modules/CMakeLists.txt:3 (include):
include could not find requested file:

FindPrefixFromConfig

CMake Error at cmake/modules/CMakeLists.txt:116 (find_prefix_from_config):
Unknown CMake command “find_prefix_from_config”.

– Configuring incomplete, errors occurred!
See also “/home/koti/buildroot-desktop/buildroot/output/build/host-llvm-15.0.0/buildroot-build/CMakeFiles/CMakeOutput.log”.
See also “/home/koti/buildroot-desktop/buildroot/output/build/host-llvm-15.0.0/buildroot-build/CMakeFiles/CMakeError.log”.
make[1]: *** [package/pkg-generic.mk:240: /home/koti/buildroot-desktop/buildroot/output/build/host-llvm-15.0.0/.stamp_configured] Error 1
make: *** [Makefile:84: _all] Error 2
}}

Please find CMakeError log:

Determining if the include file malloc/malloc.h exists failed with the following output:
Change Dir: /home/koti/buildroot-desktop/buildroot/output/build/host-llvm-15.0.0/buildroot-build/CMakeFiles/CMakeTmp

Run Build Command(s):/usr/bin/gmake -f Makefile cmTC_1cd31/fast && gmake[2]: Entering directory ‘/home/koti/buildroot-desktop/buildroot/output/build/host-llvm-15.0.0/buildroot-build/CMakeFiles/CMakeTmp’
/usr/bin/gmake -f CMakeFiles/cmTC_1cd31.dir/build.make CMakeFiles/cmTC_1cd31.dir/build
gmake[3]: Entering directory ‘/home/koti/buildroot-desktop/buildroot/output/build/host-llvm-15.0.0/buildroot-build/CMakeFiles/CMakeTmp’
Building C object CMakeFiles/cmTC_1cd31.dir/CheckIncludeFile.c.o
/usr/bin/gcc -O2 -I/home/koti/buildroot-desktop/buildroot/output/host/include -o CMakeFiles/cmTC_1cd31.dir/CheckIncludeFile.c.o -c /home/koti/buildroot-desktop/buildroot/output/build/host-llvm-15.0.0/buildroot-build/CMakeFiles/CMakeTmp/CheckIncludeFile.c
/home/koti/buildroot-desktop/buildroot/output/build/host-llvm-15.0.0/buildroot-build/CMakeFiles/CMakeTmp/CheckIncludeFile.c:1:10: fatal error: malloc/malloc.h: No such file or directory
1 | #include <malloc/malloc.h>
| ^~~~~~~~~~~~~~~~~
compilation terminated.
gmake[3]: *** [CMakeFiles/cmTC_1cd31.dir/build.make:78: CMakeFiles/cmTC_1cd31.dir/CheckIncludeFile.c.o] Error 1
gmake[3]: Leaving directory ‘/home/koti/buildroot-desktop/buildroot/output/build/host-llvm-15.0.0/buildroot-build/CMakeFiles/CMakeTmp’
gmake[2]: *** [Makefile:127: cmTC_1cd31/fast] Error 2
gmake[2]: Leaving directory ‘/home/koti/buildroot-desktop/buildroot/output/build/host-llvm-15.0.0/buildroot-build/CMakeFiles/CMakeTmp’

Determining if the include file valgrind/valgrind.h exists failed with the following output:
Change Dir: /home/koti/buildroot-desktop/buildroot/output/build/host-llvm-15.0.0/buildroot-build/CMakeFiles/CMakeTmp

Run Build Command(s):/usr/bin/gmake -f Makefile cmTC_e90cd/fast && gmake[2]: Entering directory ‘/home/koti/buildroot-desktop/buildroot/output/build/host-llvm-15.0.0/buildroot-build/CMakeFiles/CMakeTmp’
/usr/bin/gmake -f CMakeFiles/cmTC_e90cd.dir/build.make CMakeFiles/cmTC_e90cd.dir/build
gmake[3]: Entering directory ‘/home/koti/buildroot-desktop/buildroot/output/build/host-llvm-15.0.0/buildroot-build/CMakeFiles/CMakeTmp’
Building C object CMakeFiles/cmTC_e90cd.dir/CheckIncludeFile.c.o
/usr/bin/gcc -O2 -I/home/koti/buildroot-desktop/buildroot/output/host/include -o CMakeFiles/cmTC_e90cd.dir/CheckIncludeFile.c.o -c /home/koti/buildroot-desktop/buildroot/output/build/host-llvm-15.0.0/buildroot-build/CMakeFiles/CMakeTmp/CheckIncludeFile.c
/home/koti/buildroot-desktop/buildroot/output/build/host-llvm-15.0.0/buildroot-build/CMakeFiles/CMakeTmp/CheckIncludeFile.c:1:10: fatal error: valgrind/valgrind.h: No such file or directory
1 | #include <valgrind/valgrind.h>
| ^~~~~~~~~~~~~~~~~~~~~
compilation terminated.
gmake[3]: *** [CMakeFiles/cmTC_e90cd.dir/build.make:78: CMakeFiles/cmTC_e90cd.dir/CheckIncludeFile.c.o] Error 1
gmake[3]: Leaving directory ‘/home/koti/buildroot-desktop/buildroot/output/build/host-llvm-15.0.0/buildroot-build/CMakeFiles/CMakeTmp’
gmake[2]: *** [Makefile:127: cmTC_e90cd/fast] Error 2
gmake[2]: Leaving directory ‘/home/koti/buildroot-desktop/buildroot/output/build/host-llvm-15.0.0/buildroot-build/CMakeFiles/CMakeTmp’

Determining if the include file mach/mach.h exists failed with the following output:
Change Dir: /home/koti/buildroot-desktop/buildroot/output/build/host-llvm-15.0.0/buildroot-build/CMakeFiles/CMakeTmp

Run Build Command(s):/usr/bin/gmake -f Makefile cmTC_35d02/fast && gmake[2]: Entering directory ‘/home/koti/buildroot-desktop/buildroot/output/build/host-llvm-15.0.0/buildroot-build/CMakeFiles/CMakeTmp’
/usr/bin/gmake -f CMakeFiles/cmTC_35d02.dir/build.make CMakeFiles/cmTC_35d02.dir/build
gmake[3]: Entering directory ‘/home/koti/buildroot-desktop/buildroot/output/build/host-llvm-15.0.0/buildroot-build/CMakeFiles/CMakeTmp’
Building C object CMakeFiles/cmTC_35d02.dir/CheckIncludeFile.c.o
/usr/bin/gcc -O2 -I/home/koti/buildroot-desktop/buildroot/output/host/include -o CMakeFiles/cmTC_35d02.dir/CheckIncludeFile.c.o -c /home/koti/buildroot-desktop/buildroot/output/build/host-llvm-15.0.0/buildroot-build/CMakeFiles/CMakeTmp/CheckIncludeFile.c
/home/koti/buildroot-desktop/buildroot/output/build/host-llvm-15.0.0/buildroot-build/CMakeFiles/CMakeTmp/CheckIncludeFile.c:1:10: fatal error: mach/mach.h: No such file or directory
1 | #include <mach/mach.h>
| ^~~~~~~~~~~~~
compilation terminated.
gmake[3]: *** [CMakeFiles/cmTC_35d02.dir/build.make:78: CMakeFiles/cmTC_35d02.dir/CheckIncludeFile.c.o] Error 1
gmake[3]: Leaving directory ‘/home/koti/buildroot-desktop/buildroot/output/build/host-llvm-15.0.0/buildroot-build/CMakeFiles/CMakeTmp’
gmake[2]: *** [Makefile:127: cmTC_35d02/fast] Error 2
gmake[2]: Leaving directory ‘/home/koti/buildroot-desktop/buildroot/output/build/host-llvm-15.0.0/buildroot-build/CMakeFiles/CMakeTmp’

Determining if the include file CrashReporterClient.h exists failed with the following output:
Change Dir: /home/koti/buildroot-desktop/buildroot/output/build/host-llvm-15.0.0/buildroot-build/CMakeFiles/CMakeTmp

Run Build Command(s):/usr/bin/gmake -f Makefile cmTC_251c5/fast && gmake[2]: Entering directory ‘/home/koti/buildroot-desktop/buildroot/output/build/host-llvm-15.0.0/buildroot-build/CMakeFiles/CMakeTmp’
/usr/bin/gmake -f CMakeFiles/cmTC_251c5.dir/build.make CMakeFiles/cmTC_251c5.dir/build
gmake[3]: Entering directory ‘/home/koti/buildroot-desktop/buildroot/output/build/host-llvm-15.0.0/buildroot-build/CMakeFiles/CMakeTmp’
Building C object CMakeFiles/cmTC_251c5.dir/CheckIncludeFile.c.o
/usr/bin/gcc -O2 -I/home/koti/buildroot-desktop/buildroot/output/host/include -o CMakeFiles/cmTC_251c5.dir/CheckIncludeFile.c.o -c /home/koti/buildroot-desktop/buildroot/output/build/host-llvm-15.0.0/buildroot-build/CMakeFiles/CMakeTmp/CheckIncludeFile.c
/home/koti/buildroot-desktop/buildroot/output/build/host-llvm-15.0.0/buildroot-build/CMakeFiles/CMakeTmp/CheckIncludeFile.c:1:10: fatal error: CrashReporterClient.h: No such file or directory
1 | #include <CrashReporterClient.h>
| ^~~~~~~~~~~~~~~~~~~~~~~
compilation terminated.
gmake[3]: *** [CMakeFiles/cmTC_251c5.dir/build.make:78: CMakeFiles/cmTC_251c5.dir/CheckIncludeFile.c.o] Error 1
gmake[3]: Leaving directory ‘/home/koti/buildroot-desktop/buildroot/output/build/host-llvm-15.0.0/buildroot-build/CMakeFiles/CMakeTmp’
gmake[2]: *** [Makefile:127: cmTC_251c5/fast] Error 2
gmake[2]: Leaving directory ‘/home/koti/buildroot-desktop/buildroot/output/build/host-llvm-15.0.0/buildroot-build/CMakeFiles/CMakeTmp’

Determining if the function pfm_initialize exists in the pfm failed with the following output:
Change Dir: /home/koti/buildroot-desktop/buildroot/output/build/host-llvm-15.0.0/buildroot-build/CMakeFiles/CMakeTmp

Run Build Command(s):/usr/bin/gmake -f Makefile cmTC_821ee/fast && gmake[2]: Entering directory ‘/home/koti/buildroot-desktop/buildroot/output/build/host-llvm-15.0.0/buildroot-build/CMakeFiles/CMakeTmp’
/usr/bin/gmake -f CMakeFiles/cmTC_821ee.dir/build.make CMakeFiles/cmTC_821ee.dir/build
gmake[3]: Entering directory ‘/home/koti/buildroot-desktop/buildroot/output/build/host-llvm-15.0.0/buildroot-build/CMakeFiles/CMakeTmp’
Building C object CMakeFiles/cmTC_821ee.dir/CheckFunctionExists.c.o
/usr/bin/gcc -O2 -I/home/koti/buildroot-desktop/buildroot/output/host/include -DCHECK_FUNCTION_EXISTS=pfm_initialize -o CMakeFiles/cmTC_821ee.dir/CheckFunctionExists.c.o -c /usr/share/cmake-3.22/Modules/CheckFunctionExists.c
Linking C executable cmTC_821ee
/usr/bin/cmake -E cmake_link_script CMakeFiles/cmTC_821ee.dir/link.txt --verbose=1
/usr/bin/gcc -O2 -I/home/koti/buildroot-desktop/buildroot/output/host/include -DCHECK_FUNCTION_EXISTS=pfm_initialize -L/home/koti/buildroot-desktop/buildroot/output/host/lib -Wl,-rpath,/home/koti/buildroot-desktop/buildroot/output/host/lib CMakeFiles/cmTC_821ee.dir/CheckFunctionExists.c.o -o cmTC_821ee -lpfm -lm
/usr/bin/ld: cannot find -lpfm: No such file or directory
collect2: error: ld returned 1 exit status
gmake[3]: *** [CMakeFiles/cmTC_821ee.dir/build.make:99: cmTC_821ee] Error 1
gmake[3]: Leaving directory ‘/home/koti/buildroot-desktop/buildroot/output/build/host-llvm-15.0.0/buildroot-build/CMakeFiles/CMakeTmp’
gmake[2]: *** [Makefile:127: cmTC_821ee/fast] Error 2
gmake[2]: Leaving directory ‘/home/koti/buildroot-desktop/buildroot/output/build/host-llvm-15.0.0/buildroot-build/CMakeFiles/CMakeTmp’

Determining if the function xar_open exists in the xar failed with the following output:
Change Dir: /home/koti/buildroot-desktop/buildroot/output/build/host-llvm-15.0.0/buildroot-build/CMakeFiles/CMakeTmp

Run Build Command(s):/usr/bin/gmake -f Makefile cmTC_c3253/fast && gmake[2]: Entering directory ‘/home/koti/buildroot-desktop/buildroot/output/build/host-llvm-15.0.0/buildroot-build/CMakeFiles/CMakeTmp’
/usr/bin/gmake -f CMakeFiles/cmTC_c3253.dir/build.make CMakeFiles/cmTC_c3253.dir/build
gmake[3]: Entering directory ‘/home/koti/buildroot-desktop/buildroot/output/build/host-llvm-15.0.0/buildroot-build/CMakeFiles/CMakeTmp’
Building C object CMakeFiles/cmTC_c3253.dir/CheckFunctionExists.c.o
/usr/bin/gcc -O2 -I/home/koti/buildroot-desktop/buildroot/output/host/include -DCHECK_FUNCTION_EXISTS=xar_open -o CMakeFiles/cmTC_c3253.dir/CheckFunctionExists.c.o -c /usr/share/cmake-3.22/Modules/CheckFunctionExists.c
Linking C executable cmTC_c3253
/usr/bin/cmake -E cmake_link_script CMakeFiles/cmTC_c3253.dir/link.txt --verbose=1
/usr/bin/gcc -O2 -I/home/koti/buildroot-desktop/buildroot/output/host/include -DCHECK_FUNCTION_EXISTS=xar_open -L/home/koti/buildroot-desktop/buildroot/output/host/lib -Wl,-rpath,/home/koti/buildroot-desktop/buildroot/output/host/lib CMakeFiles/cmTC_c3253.dir/CheckFunctionExists.c.o -o cmTC_c3253 -lxar -lm
/usr/bin/ld: cannot find -lxar: No such file or directory
collect2: error: ld returned 1 exit status
gmake[3]: *** [CMakeFiles/cmTC_c3253.dir/build.make:99: cmTC_c3253] Error 1
gmake[3]: Leaving directory ‘/home/koti/buildroot-desktop/buildroot/output/build/host-llvm-15.0.0/buildroot-build/CMakeFiles/CMakeTmp’
gmake[2]: *** [Makefile:127: cmTC_c3253/fast] Error 2
gmake[2]: Leaving directory ‘/home/koti/buildroot-desktop/buildroot/output/build/host-llvm-15.0.0/buildroot-build/CMakeFiles/CMakeTmp’

Determining if the arc4random exist failed with the following output:
Change Dir: /home/koti/buildroot-desktop/buildroot/output/build/host-llvm-15.0.0/buildroot-build/CMakeFiles/CMakeTmp

Run Build Command(s):/usr/bin/gmake -f Makefile cmTC_72dc6/fast && gmake[2]: Entering directory ‘/home/koti/buildroot-desktop/buildroot/output/build/host-llvm-15.0.0/buildroot-build/CMakeFiles/CMakeTmp’
/usr/bin/gmake -f CMakeFiles/cmTC_72dc6.dir/build.make CMakeFiles/cmTC_72dc6.dir/build
gmake[3]: Entering directory ‘/home/koti/buildroot-desktop/buildroot/output/build/host-llvm-15.0.0/buildroot-build/CMakeFiles/CMakeTmp’
Building C object CMakeFiles/cmTC_72dc6.dir/CheckSymbolExists.c.o
/usr/bin/gcc -O2 -I/home/koti/buildroot-desktop/buildroot/output/host/include -o CMakeFiles/cmTC_72dc6.dir/CheckSymbolExists.c.o -c /home/koti/buildroot-desktop/buildroot/output/build/host-llvm-15.0.0/buildroot-build/CMakeFiles/CMakeTmp/CheckSymbolExists.c
/home/koti/buildroot-desktop/buildroot/output/build/host-llvm-15.0.0/buildroot-build/CMakeFiles/CMakeTmp/CheckSymbolExists.c: In function ‘main’:
/home/koti/buildroot-desktop/buildroot/output/build/host-llvm-15.0.0/buildroot-build/CMakeFiles/CMakeTmp/CheckSymbolExists.c:8:19: error: ‘arc4random’ undeclared (first use in this function); did you mean ‘srandom’?
8 | return ((int*)(&arc4random))[argc];
| ^~~~~~~~~~
| srandom
/home/koti/buildroot-desktop/buildroot/output/build/host-llvm-15.0.0/buildroot-build/CMakeFiles/CMakeTmp/CheckSymbolExists.c:8:19: note: each undeclared identifier is reported only once for each function it appears in
gmake[3]: *** [CMakeFiles/cmTC_72dc6.dir/build.make:78: CMakeFiles/cmTC_72dc6.dir/CheckSymbolExists.c.o] Error 1
gmake[3]: Leaving directory ‘/home/koti/buildroot-desktop/buildroot/output/build/host-llvm-15.0.0/buildroot-build/CMakeFiles/CMakeTmp’
gmake[2]: *** [Makefile:127: cmTC_72dc6/fast] Error 2
gmake[2]: Leaving directory ‘/home/koti/buildroot-desktop/buildroot/output/build/host-llvm-15.0.0/buildroot-build/CMakeFiles/CMakeTmp’

File /home/koti/buildroot-desktop/buildroot/output/build/host-llvm-15.0.0/buildroot-build/CMakeFiles/CMakeTmp/CheckSymbolExists.c:
/* */
#include <stdlib.h>

int main(int argc, char** argv)
{
(void)argv;
#ifndef arc4random
return ((int*)(&arc4random))[argc];
#else
(void)argc;
return 0;
#endif
}
Performing C SOURCE FILE Test C_SUPPORTS_WERROR_UNGUARDED_AVAILABILITY_NEW failed with the following output:
Change Dir: /home/koti/buildroot-desktop/buildroot/output/build/host-llvm-15.0.0/buildroot-build/CMakeFiles/CMakeTmp

Run Build Command(s):/usr/bin/gmake -f Makefile cmTC_86dee/fast && gmake[2]: Entering directory ‘/home/koti/buildroot-desktop/buildroot/output/build/host-llvm-15.0.0/buildroot-build/CMakeFiles/CMakeTmp’
/usr/bin/gmake -f CMakeFiles/cmTC_86dee.dir/build.make CMakeFiles/cmTC_86dee.dir/build
gmake[3]: Entering directory ‘/home/koti/buildroot-desktop/buildroot/output/build/host-llvm-15.0.0/buildroot-build/CMakeFiles/CMakeTmp’
Building C object CMakeFiles/cmTC_86dee.dir/src.c.o
/usr/bin/gcc -DC_SUPPORTS_WERROR_UNGUARDED_AVAILABILITY_NEW -O2 -I/home/koti/buildroot-desktop/buildroot/output/host/include -Werror=unguarded-availability-new -o CMakeFiles/cmTC_86dee.dir/src.c.o -c /home/koti/buildroot-desktop/buildroot/output/build/host-llvm-15.0.0/buildroot-build/CMakeFiles/CMakeTmp/src.c
cc1: error: ‘-Werror=unguarded-availability-new’: no option ‘-Wunguarded-availability-new’
gmake[3]: *** [CMakeFiles/cmTC_86dee.dir/build.make:78: CMakeFiles/cmTC_86dee.dir/src.c.o] Error 1
gmake[3]: Leaving directory ‘/home/koti/buildroot-desktop/buildroot/output/build/host-llvm-15.0.0/buildroot-build/CMakeFiles/CMakeTmp’
gmake[2]: *** [Makefile:127: cmTC_86dee/fast] Error 2
gmake[2]: Leaving directory ‘/home/koti/buildroot-desktop/buildroot/output/build/host-llvm-15.0.0/buildroot-build/CMakeFiles/CMakeTmp’

Source file was:
int main(void) { return 0; }
Determining if the __unw_add_dynamic_fde exist failed with the following output:
Change Dir: /home/koti/buildroot-desktop/buildroot/output/build/host-llvm-15.0.0/buildroot-build/CMakeFiles/CMakeTmp

Run Build Command(s):/usr/bin/gmake -f Makefile cmTC_27128/fast && gmake[2]: Entering directory ‘/home/koti/buildroot-desktop/buildroot/output/build/host-llvm-15.0.0/buildroot-build/CMakeFiles/CMakeTmp’
/usr/bin/gmake -f CMakeFiles/cmTC_27128.dir/build.make CMakeFiles/cmTC_27128.dir/build
gmake[3]: Entering directory ‘/home/koti/buildroot-desktop/buildroot/output/build/host-llvm-15.0.0/buildroot-build/CMakeFiles/CMakeTmp’
Building C object CMakeFiles/cmTC_27128.dir/CheckSymbolExists.c.o
/usr/bin/gcc -O2 -I/home/koti/buildroot-desktop/buildroot/output/host/include -o CMakeFiles/cmTC_27128.dir/CheckSymbolExists.c.o -c /home/koti/buildroot-desktop/buildroot/output/build/host-llvm-15.0.0/buildroot-build/CMakeFiles/CMakeTmp/CheckSymbolExists.c
Linking C executable cmTC_27128
/usr/bin/cmake -E cmake_link_script CMakeFiles/cmTC_27128.dir/link.txt --verbose=1
/usr/bin/gcc -O2 -I/home/koti/buildroot-desktop/buildroot/output/host/include -L/home/koti/buildroot-desktop/buildroot/output/host/lib -Wl,-rpath,/home/koti/buildroot-desktop/buildroot/output/host/lib CMakeFiles/cmTC_27128.dir/CheckSymbolExists.c.o -o cmTC_27128 -lm
/usr/bin/ld: CMakeFiles/cmTC_27128.dir/CheckSymbolExists.c.o: in function main': CheckSymbolExists.c:(.text.startup+0x7): undefined reference to __unw_add_dynamic_fde’
collect2: error: ld returned 1 exit status
gmake[3]: *** [CMakeFiles/cmTC_27128.dir/build.make:99: cmTC_27128] Error 1
gmake[3]: Leaving directory ‘/home/koti/buildroot-desktop/buildroot/output/build/host-llvm-15.0.0/buildroot-build/CMakeFiles/CMakeTmp’
gmake[2]: *** [Makefile:127: cmTC_27128/fast] Error 2
gmake[2]: Leaving directory ‘/home/koti/buildroot-desktop/buildroot/output/build/host-llvm-15.0.0/buildroot-build/CMakeFiles/CMakeTmp’

File /home/koti/buildroot-desktop/buildroot/output/build/host-llvm-15.0.0/buildroot-build/CMakeFiles/CMakeTmp/CheckSymbolExists.c:
/* */
#include </home/koti/buildroot-desktop/buildroot/output/build/host-llvm-15.0.0/cmake/unwind.h>

int main(int argc, char** argv)
{
(void)argv;
#ifndef __unw_add_dynamic_fde
return ((int*)(&__unw_add_dynamic_fde))[argc];
#else
(void)argc;
return 0;
#endif
}
Determining if the mallctl exist failed with the following output:
Change Dir: /home/koti/buildroot-desktop/buildroot/output/build/host-llvm-15.0.0/buildroot-build/CMakeFiles/CMakeTmp

Run Build Command(s):/usr/bin/gmake -f Makefile cmTC_63648/fast && gmake[2]: Entering directory ‘/home/koti/buildroot-desktop/buildroot/output/build/host-llvm-15.0.0/buildroot-build/CMakeFiles/CMakeTmp’
/usr/bin/gmake -f CMakeFiles/cmTC_63648.dir/build.make CMakeFiles/cmTC_63648.dir/build
gmake[3]: Entering directory ‘/home/koti/buildroot-desktop/buildroot/output/build/host-llvm-15.0.0/buildroot-build/CMakeFiles/CMakeTmp’
Building C object CMakeFiles/cmTC_63648.dir/CheckSymbolExists.c.o
/usr/bin/gcc -O2 -I/home/koti/buildroot-desktop/buildroot/output/host/include -o CMakeFiles/cmTC_63648.dir/CheckSymbolExists.c.o -c /home/koti/buildroot-desktop/buildroot/output/build/host-llvm-15.0.0/buildroot-build/CMakeFiles/CMakeTmp/CheckSymbolExists.c
/home/koti/buildroot-desktop/buildroot/output/build/host-llvm-15.0.0/buildroot-build/CMakeFiles/CMakeTmp/CheckSymbolExists.c:2:10: fatal error: malloc_np.h: No such file or directory
2 | #include <malloc_np.h>
| ^~~~~~~~~~~~~
compilation terminated.
gmake[3]: *** [CMakeFiles/cmTC_63648.dir/build.make:78: CMakeFiles/cmTC_63648.dir/CheckSymbolExists.c.o] Error 1
gmake[3]: Leaving directory ‘/home/koti/buildroot-desktop/buildroot/output/build/host-llvm-15.0.0/buildroot-build/CMakeFiles/CMakeTmp’
gmake[2]: *** [Makefile:127: cmTC_63648/fast] Error 2
gmake[2]: Leaving directory ‘/home/koti/buildroot-desktop/buildroot/output/build/host-llvm-15.0.0/buildroot-build/CMakeFiles/CMakeTmp’

File /home/koti/buildroot-desktop/buildroot/output/build/host-llvm-15.0.0/buildroot-build/CMakeFiles/CMakeTmp/CheckSymbolExists.c:
/* */
#include <malloc_np.h>

int main(int argc, char** argv)
{
(void)argv;
#ifndef mallctl
return ((int*)(&mallctl))[argc];
#else
(void)argc;
return 0;
#endif
}
Determining if the malloc_zone_statistics exist failed with the following output:
Change Dir: /home/koti/buildroot-desktop/buildroot/output/build/host-llvm-15.0.0/buildroot-build/CMakeFiles/CMakeTmp

Run Build Command(s):/usr/bin/gmake -f Makefile cmTC_e30e2/fast && gmake[2]: Entering directory ‘/home/koti/buildroot-desktop/buildroot/output/build/host-llvm-15.0.0/buildroot-build/CMakeFiles/CMakeTmp’
/usr/bin/gmake -f CMakeFiles/cmTC_e30e2.dir/build.make CMakeFiles/cmTC_e30e2.dir/build
gmake[3]: Entering directory ‘/home/koti/buildroot-desktop/buildroot/output/build/host-llvm-15.0.0/buildroot-build/CMakeFiles/CMakeTmp’
Building C object CMakeFiles/cmTC_e30e2.dir/CheckSymbolExists.c.o
/usr/bin/gcc -O2 -I/home/koti/buildroot-desktop/buildroot/output/host/include -o CMakeFiles/cmTC_e30e2.dir/CheckSymbolExists.c.o -c /home/koti/buildroot-desktop/buildroot/output/build/host-llvm-15.0.0/buildroot-build/CMakeFiles/CMakeTmp/CheckSymbolExists.c
/home/koti/buildroot-desktop/buildroot/output/build/host-llvm-15.0.0/buildroot-build/CMakeFiles/CMakeTmp/CheckSymbolExists.c:2:10: fatal error: malloc/malloc.h: No such file or directory
2 | #include <malloc/malloc.h>
| ^~~~~~~~~~~~~~~~~
compilation terminated.
gmake[3]: *** [CMakeFiles/cmTC_e30e2.dir/build.make:78: CMakeFiles/cmTC_e30e2.dir/CheckSymbolExists.c.o] Error 1
gmake[3]: Leaving directory ‘/home/koti/buildroot-desktop/buildroot/output/build/host-llvm-15.0.0/buildroot-build/CMakeFiles/CMakeTmp’
gmake[2]: *** [Makefile:127: cmTC_e30e2/fast] Error 2
gmake[2]: Leaving directory ‘/home/koti/buildroot-desktop/buildroot/output/build/host-llvm-15.0.0/buildroot-build/CMakeFiles/CMakeTmp’

File /home/koti/buildroot-desktop/buildroot/output/build/host-llvm-15.0.0/buildroot-build/CMakeFiles/CMakeTmp/CheckSymbolExists.c:
/* */
#include <malloc/malloc.h>

int main(int argc, char** argv)
{
(void)argv;
#ifndef malloc_zone_statistics
return ((int*)(&malloc_zone_statistics))[argc];
#else
(void)argc;
return 0;
#endif
}
Determining if the strerror_s exist failed with the following output:
Change Dir: /home/koti/buildroot-desktop/buildroot/output/build/host-llvm-15.0.0/buildroot-build/CMakeFiles/CMakeTmp

Run Build Command(s):/usr/bin/gmake -f Makefile cmTC_5fa98/fast && gmake[2]: Entering directory ‘/home/koti/buildroot-desktop/buildroot/output/build/host-llvm-15.0.0/buildroot-build/CMakeFiles/CMakeTmp’
/usr/bin/gmake -f CMakeFiles/cmTC_5fa98.dir/build.make CMakeFiles/cmTC_5fa98.dir/build
gmake[3]: Entering directory ‘/home/koti/buildroot-desktop/buildroot/output/build/host-llvm-15.0.0/buildroot-build/CMakeFiles/CMakeTmp’
Building C object CMakeFiles/cmTC_5fa98.dir/CheckSymbolExists.c.o
/usr/bin/gcc -O2 -I/home/koti/buildroot-desktop/buildroot/output/host/include -o CMakeFiles/cmTC_5fa98.dir/CheckSymbolExists.c.o -c /home/koti/buildroot-desktop/buildroot/output/build/host-llvm-15.0.0/buildroot-build/CMakeFiles/CMakeTmp/CheckSymbolExists.c
/home/koti/buildroot-desktop/buildroot/output/build/host-llvm-15.0.0/buildroot-build/CMakeFiles/CMakeTmp/CheckSymbolExists.c: In function ‘main’:
/home/koti/buildroot-desktop/buildroot/output/build/host-llvm-15.0.0/buildroot-build/CMakeFiles/CMakeTmp/CheckSymbolExists.c:8:19: error: ‘strerror_s’ undeclared (first use in this function); did you mean ‘strerror_l’?
8 | return ((int*)(&strerror_s))[argc];
| ^~~~~~~~~~
| strerror_l
/home/koti/buildroot-desktop/buildroot/output/build/host-llvm-15.0.0/buildroot-build/CMakeFiles/CMakeTmp/CheckSymbolExists.c:8:19: note: each undeclared identifier is reported only once for each function it appears in
gmake[3]: *** [CMakeFiles/cmTC_5fa98.dir/build.make:78: CMakeFiles/cmTC_5fa98.dir/CheckSymbolExists.c.o] Error 1
gmake[3]: Leaving directory ‘/home/koti/buildroot-desktop/buildroot/output/build/host-llvm-15.0.0/buildroot-build/CMakeFiles/CMakeTmp’
gmake[2]: *** [Makefile:127: cmTC_5fa98/fast] Error 2
gmake[2]: Leaving directory ‘/home/koti/buildroot-desktop/buildroot/output/build/host-llvm-15.0.0/buildroot-build/CMakeFiles/CMakeTmp’

File /home/koti/buildroot-desktop/buildroot/output/build/host-llvm-15.0.0/buildroot-build/CMakeFiles/CMakeTmp/CheckSymbolExists.c:
/* */
#include <string.h>

int main(int argc, char** argv)
{
(void)argv;
#ifndef strerror_s
return ((int*)(&strerror_s))[argc];
#else
(void)argc;
return 0;
#endif
}
Determining if the dladdr exist failed with the following output:
Change Dir: /home/koti/buildroot-desktop/buildroot/output/build/host-llvm-15.0.0/buildroot-build/CMakeFiles/CMakeTmp

Run Build Command(s):/usr/bin/gmake -f Makefile cmTC_48afe/fast && gmake[2]: Entering directory ‘/home/koti/buildroot-desktop/buildroot/output/build/host-llvm-15.0.0/buildroot-build/CMakeFiles/CMakeTmp’
/usr/bin/gmake -f CMakeFiles/cmTC_48afe.dir/build.make CMakeFiles/cmTC_48afe.dir/build
gmake[3]: Entering directory ‘/home/koti/buildroot-desktop/buildroot/output/build/host-llvm-15.0.0/buildroot-build/CMakeFiles/CMakeTmp’
Building C object CMakeFiles/cmTC_48afe.dir/CheckSymbolExists.c.o
/usr/bin/gcc -O2 -I/home/koti/buildroot-desktop/buildroot/output/host/include -o CMakeFiles/cmTC_48afe.dir/CheckSymbolExists.c.o -c /home/koti/buildroot-desktop/buildroot/output/build/host-llvm-15.0.0/buildroot-build/CMakeFiles/CMakeTmp/CheckSymbolExists.c
/home/koti/buildroot-desktop/buildroot/output/build/host-llvm-15.0.0/buildroot-build/CMakeFiles/CMakeTmp/CheckSymbolExists.c: In function ‘main’:
/home/koti/buildroot-desktop/buildroot/output/build/host-llvm-15.0.0/buildroot-build/CMakeFiles/CMakeTmp/CheckSymbolExists.c:8:19: error: ‘dladdr’ undeclared (first use in this function)
8 | return ((int*)(&dladdr))[argc];
| ^~~~~~
/home/koti/buildroot-desktop/buildroot/output/build/host-llvm-15.0.0/buildroot-build/CMakeFiles/CMakeTmp/CheckSymbolExists.c:8:19: note: each undeclared identifier is reported only once for each function it appears in
gmake[3]: *** [CMakeFiles/cmTC_48afe.dir/build.make:78: CMakeFiles/cmTC_48afe.dir/CheckSymbolExists.c.o] Error 1
gmake[3]: Leaving directory ‘/home/koti/buildroot-desktop/buildroot/output/build/host-llvm-15.0.0/buildroot-build/CMakeFiles/CMakeTmp’
gmake[2]: *** [Makefile:127: cmTC_48afe/fast] Error 2
gmake[2]: Leaving directory ‘/home/koti/buildroot-desktop/buildroot/output/build/host-llvm-15.0.0/buildroot-build/CMakeFiles/CMakeTmp’

File /home/koti/buildroot-desktop/buildroot/output/build/host-llvm-15.0.0/buildroot-build/CMakeFiles/CMakeTmp/CheckSymbolExists.c:
/* */
#include <dlfcn.h>

int main(int argc, char** argv)
{
(void)argv;
#ifndef dladdr
return ((int*)(&dladdr))[argc];
#else
(void)argc;
return 0;
#endif
}
Performing C SOURCE FILE Test HAVE_STRUCT_STAT_ST_MTIMESPEC_TV_NSEC failed with the following output:
Change Dir: /home/koti/buildroot-desktop/buildroot/output/build/host-llvm-15.0.0/buildroot-build/CMakeFiles/CMakeTmp

Run Build Command(s):/usr/bin/gmake -f Makefile cmTC_5299e/fast && gmake[2]: Entering directory ‘/home/koti/buildroot-desktop/buildroot/output/build/host-llvm-15.0.0/buildroot-build/CMakeFiles/CMakeTmp’
/usr/bin/gmake -f CMakeFiles/cmTC_5299e.dir/build.make CMakeFiles/cmTC_5299e.dir/build
gmake[3]: Entering directory ‘/home/koti/buildroot-desktop/buildroot/output/build/host-llvm-15.0.0/buildroot-build/CMakeFiles/CMakeTmp’
Building C object CMakeFiles/cmTC_5299e.dir/src.c.o
/usr/bin/gcc -DHAVE_STRUCT_STAT_ST_MTIMESPEC_TV_NSEC -O2 -I/home/koti/buildroot-desktop/buildroot/output/host/include -o CMakeFiles/cmTC_5299e.dir/src.c.o -c /home/koti/buildroot-desktop/buildroot/output/build/host-llvm-15.0.0/buildroot-build/CMakeFiles/CMakeTmp/src.c
/home/koti/buildroot-desktop/buildroot/output/build/host-llvm-15.0.0/buildroot-build/CMakeFiles/CMakeTmp/src.c: In function ‘main’:
/home/koti/buildroot-desktop/buildroot/output/build/host-llvm-15.0.0/buildroot-build/CMakeFiles/CMakeTmp/src.c:7:34: error: ‘struct stat’ has no member named ‘st_mtimespec’
7 | (void)sizeof(((struct stat *)0)->st_mtimespec.tv_nsec);
| ^~
gmake[3]: *** [CMakeFiles/cmTC_5299e.dir/build.make:78: CMakeFiles/cmTC_5299e.dir/src.c.o] Error 1
gmake[3]: Leaving directory ‘/home/koti/buildroot-desktop/buildroot/output/build/host-llvm-15.0.0/buildroot-build/CMakeFiles/CMakeTmp’
gmake[2]: *** [Makefile:127: cmTC_5299e/fast] Error 2
gmake[2]: Leaving directory ‘/home/koti/buildroot-desktop/buildroot/output/build/host-llvm-15.0.0/buildroot-build/CMakeFiles/CMakeTmp’

Source file was:

#include <sys/types.h>
#include <sys/stat.h>

int main()
{
(void)sizeof(((struct stat *)0)->st_mtimespec.tv_nsec);
return 0;
}

Determining if the proc_pid_rusage exist failed with the following output:
Change Dir: /home/koti/buildroot-desktop/buildroot/output/build/host-llvm-15.0.0/buildroot-build/CMakeFiles/CMakeTmp

Run Build Command(s):/usr/bin/gmake -f Makefile cmTC_12d33/fast && gmake[2]: Entering directory ‘/home/koti/buildroot-desktop/buildroot/output/build/host-llvm-15.0.0/buildroot-build/CMakeFiles/CMakeTmp’
/usr/bin/gmake -f CMakeFiles/cmTC_12d33.dir/build.make CMakeFiles/cmTC_12d33.dir/build
gmake[3]: Entering directory ‘/home/koti/buildroot-desktop/buildroot/output/build/host-llvm-15.0.0/buildroot-build/CMakeFiles/CMakeTmp’
Building C object CMakeFiles/cmTC_12d33.dir/CheckSymbolExists.c.o
/usr/bin/gcc -D_GNU_SOURCE -O2 -I/home/koti/buildroot-desktop/buildroot/output/host/include -o CMakeFiles/cmTC_12d33.dir/CheckSymbolExists.c.o -c /home/koti/buildroot-desktop/buildroot/output/build/host-llvm-15.0.0/buildroot-build/CMakeFiles/CMakeTmp/CheckSymbolExists.c
/home/koti/buildroot-desktop/buildroot/output/build/host-llvm-15.0.0/buildroot-build/CMakeFiles/CMakeTmp/CheckSymbolExists.c:2:10: fatal error: libproc.h: No such file or directory
2 | #include <libproc.h>
| ^~~~~~~~~~~
compilation terminated.
gmake[3]: *** [CMakeFiles/cmTC_12d33.dir/build.make:78: CMakeFiles/cmTC_12d33.dir/CheckSymbolExists.c.o] Error 1
gmake[3]: Leaving directory ‘/home/koti/buildroot-desktop/buildroot/output/build/host-llvm-15.0.0/buildroot-build/CMakeFiles/CMakeTmp’
gmake[2]: *** [Makefile:127: cmTC_12d33/fast] Error 2
gmake[2]: Leaving directory ‘/home/koti/buildroot-desktop/buildroot/output/build/host-llvm-15.0.0/buildroot-build/CMakeFiles/CMakeTmp’

File /home/koti/buildroot-desktop/buildroot/output/build/host-llvm-15.0.0/buildroot-build/CMakeFiles/CMakeTmp/CheckSymbolExists.c:
/* */
#include <libproc.h>

int main(int argc, char** argv)
{
(void)argv;
#ifndef proc_pid_rusage
return ((int*)(&proc_pid_rusage))[argc];
#else
(void)argc;
return 0;
#endif
}
Performing C++ SOURCE FILE Test SUPPORTS_GNU_ZERO_VARIADIC_MACRO_ARGUMENTS_FLAG failed with the following output:
Change Dir: /home/koti/buildroot-desktop/buildroot/output/build/host-llvm-15.0.0/buildroot-build/CMakeFiles/CMakeTmp

Run Build Command(s):/usr/bin/gmake -f Makefile cmTC_30b5f/fast && gmake[2]: Entering directory ‘/home/koti/buildroot-desktop/buildroot/output/build/host-llvm-15.0.0/buildroot-build/CMakeFiles/CMakeTmp’
/usr/bin/gmake -f CMakeFiles/cmTC_30b5f.dir/build.make CMakeFiles/cmTC_30b5f.dir/build
gmake[3]: Entering directory ‘/home/koti/buildroot-desktop/buildroot/output/build/host-llvm-15.0.0/buildroot-build/CMakeFiles/CMakeTmp’
Building CXX object CMakeFiles/cmTC_30b5f.dir/src.cxx.o
/usr/bin/g++ -DSUPPORTS_GNU_ZERO_VARIADIC_MACRO_ARGUMENTS_FLAG -O2 -I/home/koti/buildroot-desktop/buildroot/output/host/include -Wgnu-zero-variadic-macro-arguments -std=c++14 -o CMakeFiles/cmTC_30b5f.dir/src.cxx.o -c /home/koti/buildroot-desktop/buildroot/output/build/host-llvm-15.0.0/buildroot-build/CMakeFiles/CMakeTmp/src.cxx
g++: error: unrecognized command-line option ‘-Wgnu-zero-variadic-macro-arguments’
gmake[3]: *** [CMakeFiles/cmTC_30b5f.dir/build.make:78: CMakeFiles/cmTC_30b5f.dir/src.cxx.o] Error 1
gmake[3]: Leaving directory ‘/home/koti/buildroot-desktop/buildroot/output/build/host-llvm-15.0.0/buildroot-build/CMakeFiles/CMakeTmp’
gmake[2]: *** [Makefile:127: cmTC_30b5f/fast] Error 2
gmake[2]: Leaving directory ‘/home/koti/buildroot-desktop/buildroot/output/build/host-llvm-15.0.0/buildroot-build/CMakeFiles/CMakeTmp’

Source file was:
int main() { return 0; }
Performing C++ SOURCE FILE Test CXX_SUPPORTS_WERROR_UNGUARDED_AVAILABILITY_NEW failed with the following output:
Change Dir: /home/koti/buildroot-desktop/buildroot/output/build/host-llvm-15.0.0/buildroot-build/CMakeFiles/CMakeTmp

Run Build Command(s):/usr/bin/gmake -f Makefile cmTC_88372/fast && gmake[2]: Entering directory ‘/home/koti/buildroot-desktop/buildroot/output/build/host-llvm-15.0.0/buildroot-build/CMakeFiles/CMakeTmp’
/usr/bin/gmake -f CMakeFiles/cmTC_88372.dir/build.make CMakeFiles/cmTC_88372.dir/build
gmake[3]: Entering directory ‘/home/koti/buildroot-desktop/buildroot/output/build/host-llvm-15.0.0/buildroot-build/CMakeFiles/CMakeTmp’
Building CXX object CMakeFiles/cmTC_88372.dir/src.cxx.o
/usr/bin/g++ -DCXX_SUPPORTS_WERROR_UNGUARDED_AVAILABILITY_NEW -O2 -I/home/koti/buildroot-desktop/buildroot/output/host/include -fPIC -fno-semantic-interposition -fvisibility-inlines-hidden -Werror=date-time -Werror -Werror=unguarded-availability-new -std=c++14 -o CMakeFiles/cmTC_88372.dir/src.cxx.o -c /home/koti/buildroot-desktop/buildroot/output/build/host-llvm-15.0.0/buildroot-build/CMakeFiles/CMakeTmp/src.cxx
cc1plus: error: ‘-Werror=unguarded-availability-new’: no option ‘-Wunguarded-availability-new’
gmake[3]: *** [CMakeFiles/cmTC_88372.dir/build.make:78: CMakeFiles/cmTC_88372.dir/src.cxx.o] Error 1
gmake[3]: Leaving directory ‘/home/koti/buildroot-desktop/buildroot/output/build/host-llvm-15.0.0/buildroot-build/CMakeFiles/CMakeTmp’
gmake[2]: *** [Makefile:127: cmTC_88372/fast] Error 2
gmake[2]: Leaving directory ‘/home/koti/buildroot-desktop/buildroot/output/build/host-llvm-15.0.0/buildroot-build/CMakeFiles/CMakeTmp’

Source file was:
int main() { return 0; }
Performing C SOURCE FILE Test C_SUPPORTS_CXX98_COMPAT_EXTRA_SEMI_FLAG failed with the following output:
Change Dir: /home/koti/buildroot-desktop/buildroot/output/build/host-llvm-15.0.0/buildroot-build/CMakeFiles/CMakeTmp

Run Build Command(s):/usr/bin/gmake -f Makefile cmTC_94b41/fast && gmake[2]: Entering directory ‘/home/koti/buildroot-desktop/buildroot/output/build/host-llvm-15.0.0/buildroot-build/CMakeFiles/CMakeTmp’
/usr/bin/gmake -f CMakeFiles/cmTC_94b41.dir/build.make CMakeFiles/cmTC_94b41.dir/build
gmake[3]: Entering directory ‘/home/koti/buildroot-desktop/buildroot/output/build/host-llvm-15.0.0/buildroot-build/CMakeFiles/CMakeTmp’
Building C object CMakeFiles/cmTC_94b41.dir/src.c.o
/usr/bin/gcc -DC_SUPPORTS_CXX98_COMPAT_EXTRA_SEMI_FLAG -O2 -I/home/koti/buildroot-desktop/buildroot/output/host/include -fPIC -fno-semantic-interposition -Werror=date-time -Wall -Wextra -Wno-unused-parameter -Wwrite-strings -Wno-missing-field-initializers -pedantic -Wno-long-long -Werror -Wc++98-compat-extra-semi -o CMakeFiles/cmTC_94b41.dir/src.c.o -c /home/koti/buildroot-desktop/buildroot/output/build/host-llvm-15.0.0/buildroot-build/CMakeFiles/CMakeTmp/src.c
gcc: error: unrecognized command-line option ‘-Wc++98-compat-extra-semi’
gmake[3]: *** [CMakeFiles/cmTC_94b41.dir/build.make:78: CMakeFiles/cmTC_94b41.dir/src.c.o] Error 1
gmake[3]: Leaving directory ‘/home/koti/buildroot-desktop/buildroot/output/build/host-llvm-15.0.0/buildroot-build/CMakeFiles/CMakeTmp’
gmake[2]: *** [Makefile:127: cmTC_94b41/fast] Error 2
gmake[2]: Leaving directory ‘/home/koti/buildroot-desktop/buildroot/output/build/host-llvm-15.0.0/buildroot-build/CMakeFiles/CMakeTmp’

Source file was:
int main(void) { return 0; }
Performing C++ SOURCE FILE Test CXX_SUPPORTS_CXX98_COMPAT_EXTRA_SEMI_FLAG failed with the following output:
Change Dir: /home/koti/buildroot-desktop/buildroot/output/build/host-llvm-15.0.0/buildroot-build/CMakeFiles/CMakeTmp

Run Build Command(s):/usr/bin/gmake -f Makefile cmTC_cf1dd/fast && gmake[2]: Entering directory ‘/home/koti/buildroot-desktop/buildroot/output/build/host-llvm-15.0.0/buildroot-build/CMakeFiles/CMakeTmp’
/usr/bin/gmake -f CMakeFiles/cmTC_cf1dd.dir/build.make CMakeFiles/cmTC_cf1dd.dir/build
gmake[3]: Entering directory ‘/home/koti/buildroot-desktop/buildroot/output/build/host-llvm-15.0.0/buildroot-build/CMakeFiles/CMakeTmp’
Building CXX object CMakeFiles/cmTC_cf1dd.dir/src.cxx.o
/usr/bin/g++ -DCXX_SUPPORTS_CXX98_COMPAT_EXTRA_SEMI_FLAG -O2 -I/home/koti/buildroot-desktop/buildroot/output/host/include -fPIC -fno-semantic-interposition -fvisibility-inlines-hidden -Werror=date-time -Wall -Wextra -Wno-unused-parameter -Wwrite-strings -Wcast-qual -Wno-missing-field-initializers -pedantic -Wno-long-long -Werror -Wc++98-compat-extra-semi -std=c++14 -o CMakeFiles/cmTC_cf1dd.dir/src.cxx.o -c /home/koti/buildroot-desktop/buildroot/output/build/host-llvm-15.0.0/buildroot-build/CMakeFiles/CMakeTmp/src.cxx
g++: error: unrecognized command-line option ‘-Wc++98-compat-extra-semi’
gmake[3]: *** [CMakeFiles/cmTC_cf1dd.dir/build.make:78: CMakeFiles/cmTC_cf1dd.dir/src.cxx.o] Error 1
gmake[3]: Leaving directory ‘/home/koti/buildroot-desktop/buildroot/output/build/host-llvm-15.0.0/buildroot-build/CMakeFiles/CMakeTmp’
gmake[2]: *** [Makefile:127: cmTC_cf1dd/fast] Error 2
gmake[2]: Leaving directory ‘/home/koti/buildroot-desktop/buildroot/output/build/host-llvm-15.0.0/buildroot-build/CMakeFiles/CMakeTmp’

Source file was:
int main() { return 0; }
Performing C SOURCE FILE Test C_SUPPORTS_COVERED_SWITCH_DEFAULT_FLAG failed with the following output:
Change Dir: /home/koti/buildroot-desktop/buildroot/output/build/host-llvm-15.0.0/buildroot-build/CMakeFiles/CMakeTmp

Run Build Command(s):/usr/bin/gmake -f Makefile cmTC_22b5a/fast && gmake[2]: Entering directory ‘/home/koti/buildroot-desktop/buildroot/output/build/host-llvm-15.0.0/buildroot-build/CMakeFiles/CMakeTmp’
/usr/bin/gmake -f CMakeFiles/cmTC_22b5a.dir/build.make CMakeFiles/cmTC_22b5a.dir/build
gmake[3]: Entering directory ‘/home/koti/buildroot-desktop/buildroot/output/build/host-llvm-15.0.0/buildroot-build/CMakeFiles/CMakeTmp’
Building C object CMakeFiles/cmTC_22b5a.dir/src.c.o
/usr/bin/gcc -DC_SUPPORTS_COVERED_SWITCH_DEFAULT_FLAG -O2 -I/home/koti/buildroot-desktop/buildroot/output/host/include -fPIC -fno-semantic-interposition -Werror=date-time -Wall -Wextra -Wno-unused-parameter -Wwrite-strings -Wno-missing-field-initializers -pedantic -Wno-long-long -Wimplicit-fallthrough -Werror -Wcovered-switch-default -o CMakeFiles/cmTC_22b5a.dir/src.c.o -c /home/koti/buildroot-desktop/buildroot/output/build/host-llvm-15.0.0/buildroot-build/CMakeFiles/CMakeTmp/src.c
gcc: error: unrecognized command-line option ‘-Wcovered-switch-default’; did you mean ‘-Wno-switch-default’?
gmake[3]: *** [CMakeFiles/cmTC_22b5a.dir/build.make:78: CMakeFiles/cmTC_22b5a.dir/src.c.o] Error 1
gmake[3]: Leaving directory ‘/home/koti/buildroot-desktop/buildroot/output/build/host-llvm-15.0.0/buildroot-build/CMakeFiles/CMakeTmp’
gmake[2]: *** [Makefile:127: cmTC_22b5a/fast] Error 2
gmake[2]: Leaving directory ‘/home/koti/buildroot-desktop/buildroot/output/build/host-llvm-15.0.0/buildroot-build/CMakeFiles/CMakeTmp’

Source file was:
int main(void) { return 0; }
Performing C++ SOURCE FILE Test CXX_SUPPORTS_COVERED_SWITCH_DEFAULT_FLAG failed with the following output:
Change Dir: /home/koti/buildroot-desktop/buildroot/output/build/host-llvm-15.0.0/buildroot-build/CMakeFiles/CMakeTmp

Run Build Command(s):/usr/bin/gmake -f Makefile cmTC_541b6/fast && gmake[2]: Entering directory ‘/home/koti/buildroot-desktop/buildroot/output/build/host-llvm-15.0.0/buildroot-build/CMakeFiles/CMakeTmp’
/usr/bin/gmake -f CMakeFiles/cmTC_541b6.dir/build.make CMakeFiles/cmTC_541b6.dir/build
gmake[3]: Entering directory ‘/home/koti/buildroot-desktop/buildroot/output/build/host-llvm-15.0.0/buildroot-build/CMakeFiles/CMakeTmp’
Building CXX object CMakeFiles/cmTC_541b6.dir/src.cxx.o
/usr/bin/g++ -DCXX_SUPPORTS_COVERED_SWITCH_DEFAULT_FLAG -O2 -I/home/koti/buildroot-desktop/buildroot/output/host/include -fPIC -fno-semantic-interposition -fvisibility-inlines-hidden -Werror=date-time -Wall -Wextra -Wno-unused-parameter -Wwrite-strings -Wcast-qual -Wno-missing-field-initializers -pedantic -Wno-long-long -Wimplicit-fallthrough -Werror -Wcovered-switch-default -std=c++14 -o CMakeFiles/cmTC_541b6.dir/src.cxx.o -c /home/koti/buildroot-desktop/buildroot/output/build/host-llvm-15.0.0/buildroot-build/CMakeFiles/CMakeTmp/src.cxx
g++: error: unrecognized command-line option ‘-Wcovered-switch-default’; did you mean ‘-Wno-switch-default’?
gmake[3]: *** [CMakeFiles/cmTC_541b6.dir/build.make:78: CMakeFiles/cmTC_541b6.dir/src.cxx.o] Error 1
gmake[3]: Leaving directory ‘/home/koti/buildroot-desktop/buildroot/output/build/host-llvm-15.0.0/buildroot-build/CMakeFiles/CMakeTmp’
gmake[2]: *** [Makefile:127: cmTC_541b6/fast] Error 2
gmake[2]: Leaving directory ‘/home/koti/buildroot-desktop/buildroot/output/build/host-llvm-15.0.0/buildroot-build/CMakeFiles/CMakeTmp’

Source file was:
int main() { return 0; }
Performing C++ SOURCE FILE Test CXX_WONT_WARN_ON_FINAL_NONVIRTUALDTOR failed with the following output:
Change Dir: /home/koti/buildroot-desktop/buildroot/output/build/host-llvm-15.0.0/buildroot-build/CMakeFiles/CMakeTmp

Run Build Command(s):/usr/bin/gmake -f Makefile cmTC_7a564/fast && gmake[2]: Entering directory ‘/home/koti/buildroot-desktop/buildroot/output/build/host-llvm-15.0.0/buildroot-build/CMakeFiles/CMakeTmp’
/usr/bin/gmake -f CMakeFiles/cmTC_7a564.dir/build.make CMakeFiles/cmTC_7a564.dir/build
gmake[3]: Entering directory ‘/home/koti/buildroot-desktop/buildroot/output/build/host-llvm-15.0.0/buildroot-build/CMakeFiles/CMakeTmp’
Building CXX object CMakeFiles/cmTC_7a564.dir/src.cxx.o
/usr/bin/g++ -DCXX_WONT_WARN_ON_FINAL_NONVIRTUALDTOR -D_GNU_SOURCE -O2 -I/home/koti/buildroot-desktop/buildroot/output/host/include -fPIC -fno-semantic-interposition -fvisibility-inlines-hidden -Werror=date-time -Wall -Wextra -Wno-unused-parameter -Wwrite-strings -Wcast-qual -Wno-missing-field-initializers -pedantic -Wno-long-long -Wimplicit-fallthrough -Wno-maybe-uninitialized -Wno-class-memaccess -Wno-redundant-move -Wno-pessimizing-move -Wno-noexcept-type -Werror=non-virtual-dtor -std=c++14 -o CMakeFiles/cmTC_7a564.dir/src.cxx.o -c /home/koti/buildroot-desktop/buildroot/output/build/host-llvm-15.0.0/buildroot-build/CMakeFiles/CMakeTmp/src.cxx
/home/koti/buildroot-desktop/buildroot/output/build/host-llvm-15.0.0/buildroot-build/CMakeFiles/CMakeTmp/src.cxx:2:36: error: ‘class base’ has virtual functions and accessible non-virtual destructor [-Werror=non-virtual-dtor]
2 | class base {friend f; public: virtual void anchor();protected: ~base();};
| ^~~~
cc1plus: some warnings being treated as errors
gmake[3]: *** [CMakeFiles/cmTC_7a564.dir/build.make:78: CMakeFiles/cmTC_7a564.dir/src.cxx.o] Error 1
gmake[3]: Leaving directory ‘/home/koti/buildroot-desktop/buildroot/output/build/host-llvm-15.0.0/buildroot-build/CMakeFiles/CMakeTmp’
gmake[2]: *** [Makefile:127: cmTC_7a564/fast] Error 2
gmake[2]: Leaving directory ‘/home/koti/buildroot-desktop/buildroot/output/build/host-llvm-15.0.0/buildroot-build/CMakeFiles/CMakeTmp’

Source file was:
class f {};
class base {friend f; public: virtual void anchor();protected: ~base();};
int main() { return 0; }
Performing C SOURCE FILE Test C_WCOMMENT_ALLOWS_LINE_WRAP failed with the following output:
Change Dir: /home/koti/buildroot-desktop/buildroot/output/build/host-llvm-15.0.0/buildroot-build/CMakeFiles/CMakeTmp

Run Build Command(s):/usr/bin/gmake -f Makefile cmTC_15e0d/fast && gmake[2]: Entering directory ‘/home/koti/buildroot-desktop/buildroot/output/build/host-llvm-15.0.0/buildroot-build/CMakeFiles/CMakeTmp’
/usr/bin/gmake -f CMakeFiles/cmTC_15e0d.dir/build.make CMakeFiles/cmTC_15e0d.dir/build
gmake[3]: Entering directory ‘/home/koti/buildroot-desktop/buildroot/output/build/host-llvm-15.0.0/buildroot-build/CMakeFiles/CMakeTmp’
Building C object CMakeFiles/cmTC_15e0d.dir/src.c.o
/usr/bin/gcc -DC_WCOMMENT_ALLOWS_LINE_WRAP -D_GNU_SOURCE -O2 -I/home/koti/buildroot-desktop/buildroot/output/host/include -fPIC -fno-semantic-interposition -Werror=date-time -Wall -Wextra -Wno-unused-parameter -Wwrite-strings -Wno-missing-field-initializers -pedantic -Wno-long-long -Wimplicit-fallthrough -Werror -Wcomment -o CMakeFiles/cmTC_15e0d.dir/src.c.o -c /home/koti/buildroot-desktop/buildroot/output/build/host-llvm-15.0.0/buildroot-build/CMakeFiles/CMakeTmp/src.c
/home/koti/buildroot-desktop/buildroot/output/build/host-llvm-15.0.0/buildroot-build/CMakeFiles/CMakeTmp/src.c:1:1: error: multi-line comment [-Werror=comment]
1 | //
| ^
cc1: all warnings being treated as errors
gmake[3]: *** [CMakeFiles/cmTC_15e0d.dir/build.make:78: CMakeFiles/cmTC_15e0d.dir/src.c.o] Error 1
gmake[3]: Leaving directory ‘/home/koti/buildroot-desktop/buildroot/output/build/host-llvm-15.0.0/buildroot-build/CMakeFiles/CMakeTmp’
gmake[2]: *** [Makefile:127: cmTC_15e0d/fast] Error 2
gmake[2]: Leaving directory ‘/home/koti/buildroot-desktop/buildroot/output/build/host-llvm-15.0.0/buildroot-build/CMakeFiles/CMakeTmp’

Source file was:
//
//
int main() {return 0;}
Performing C SOURCE FILE Test C_SUPPORTS_STRING_CONVERSION_FLAG failed with the following output:
Change Dir: /home/koti/buildroot-desktop/buildroot/output/build/host-llvm-15.0.0/buildroot-build/CMakeFiles/CMakeTmp

Run Build Command(s):/usr/bin/gmake -f Makefile cmTC_36568/fast && gmake[2]: Entering directory ‘/home/koti/buildroot-desktop/buildroot/output/build/host-llvm-15.0.0/buildroot-build/CMakeFiles/CMakeTmp’
/usr/bin/gmake -f CMakeFiles/cmTC_36568.dir/build.make CMakeFiles/cmTC_36568.dir/build
gmake[3]: Entering directory ‘/home/koti/buildroot-desktop/buildroot/output/build/host-llvm-15.0.0/buildroot-build/CMakeFiles/CMakeTmp’
Building C object CMakeFiles/cmTC_36568.dir/src.c.o
/usr/bin/gcc -DC_SUPPORTS_STRING_CONVERSION_FLAG -O2 -I/home/koti/buildroot-desktop/buildroot/output/host/include -fPIC -fno-semantic-interposition -Werror=date-time -Wall -Wextra -Wno-unused-parameter -Wwrite-strings -Wno-missing-field-initializers -pedantic -Wno-long-long -Wimplicit-fallthrough -Wno-comment -Werror -Wstring-conversion -o CMakeFiles/cmTC_36568.dir/src.c.o -c /home/koti/buildroot-desktop/buildroot/output/build/host-llvm-15.0.0/buildroot-build/CMakeFiles/CMakeTmp/src.c
gcc: error: unrecognized command-line option ‘-Wstring-conversion’; did you mean ‘-Wsign-conversion’?
gmake[3]: *** [CMakeFiles/cmTC_36568.dir/build.make:78: CMakeFiles/cmTC_36568.dir/src.c.o] Error 1
gmake[3]: Leaving directory ‘/home/koti/buildroot-desktop/buildroot/output/build/host-llvm-15.0.0/buildroot-build/CMakeFiles/CMakeTmp’
gmake[2]: *** [Makefile:127: cmTC_36568/fast] Error 2
gmake[2]: Leaving directory ‘/home/koti/buildroot-desktop/buildroot/output/build/host-llvm-15.0.0/buildroot-build/CMakeFiles/CMakeTmp’

Source file was:
int main(void) { return 0; }
Performing C++ SOURCE FILE Test CXX_SUPPORTS_STRING_CONVERSION_FLAG failed with the following output:
Change Dir: /home/koti/buildroot-desktop/buildroot/output/build/host-llvm-15.0.0/buildroot-build/CMakeFiles/CMakeTmp

Run Build Command(s):/usr/bin/gmake -f Makefile cmTC_a2eb5/fast && gmake[2]: Entering directory ‘/home/koti/buildroot-desktop/buildroot/output/build/host-llvm-15.0.0/buildroot-build/CMakeFiles/CMakeTmp’
/usr/bin/gmake -f CMakeFiles/cmTC_a2eb5.dir/build.make CMakeFiles/cmTC_a2eb5.dir/build
gmake[3]: Entering directory ‘/home/koti/buildroot-desktop/buildroot/output/build/host-llvm-15.0.0/buildroot-build/CMakeFiles/CMakeTmp’
Building CXX object CMakeFiles/cmTC_a2eb5.dir/src.cxx.o
/usr/bin/g++ -DCXX_SUPPORTS_STRING_CONVERSION_FLAG -O2 -I/home/koti/buildroot-desktop/buildroot/output/host/include -fPIC -fno-semantic-interposition -fvisibility-inlines-hidden -Werror=date-time -Wall -Wextra -Wno-unused-parameter -Wwrite-strings -Wcast-qual -Wno-missing-field-initializers -pedantic -Wno-long-long -Wimplicit-fallthrough -Wno-maybe-uninitialized -Wno-class-memaccess -Wno-redundant-move -Wno-pessimizing-move -Wno-noexcept-type -Wdelete-non-virtual-dtor -Wsuggest-override -Wno-comment -Werror -Wstring-conversion -std=c++14 -o CMakeFiles/cmTC_a2eb5.dir/src.cxx.o -c /home/koti/buildroot-desktop/buildroot/output/build/host-llvm-15.0.0/buildroot-build/CMakeFiles/CMakeTmp/src.cxx
g++: error: unrecognized command-line option ‘-Wstring-conversion’; did you mean ‘-Wsign-conversion’?
gmake[3]: *** [CMakeFiles/cmTC_a2eb5.dir/build.make:78: CMakeFiles/cmTC_a2eb5.dir/src.cxx.o] Error 1
gmake[3]: Leaving directory ‘/home/koti/buildroot-desktop/buildroot/output/build/host-llvm-15.0.0/buildroot-build/CMakeFiles/CMakeTmp’
gmake[2]: *** [Makefile:127: cmTC_a2eb5/fast] Error 2
gmake[2]: Leaving directory ‘/home/koti/buildroot-desktop/buildroot/output/build/host-llvm-15.0.0/buildroot-build/CMakeFiles/CMakeTmp’

Source file was:
int main() { return 0; }
Determining if the os_signpost_interval_begin exist failed with the following output:
Change Dir: /home/koti/buildroot-desktop/buildroot/output/build/host-llvm-15.0.0/buildroot-build/CMakeFiles/CMakeTmp

Run Build Command(s):/usr/bin/gmake -f Makefile cmTC_95227/fast && gmake[2]: Entering directory ‘/home/koti/buildroot-desktop/buildroot/output/build/host-llvm-15.0.0/buildroot-build/CMakeFiles/CMakeTmp’
/usr/bin/gmake -f CMakeFiles/cmTC_95227.dir/build.make CMakeFiles/cmTC_95227.dir/build
gmake[3]: Entering directory ‘/home/koti/buildroot-desktop/buildroot/output/build/host-llvm-15.0.0/buildroot-build/CMakeFiles/CMakeTmp’
Building C object CMakeFiles/cmTC_95227.dir/CheckSymbolExists.c.o
/usr/bin/gcc -D_GNU_SOURCE -O2 -I/home/koti/buildroot-desktop/buildroot/output/host/include -fPIC -fno-semantic-interposition -Wall -Wextra -Wno-unused-parameter -Wwrite-strings -Wno-missing-field-initializers -pedantic -Wno-long-long -Wimplicit-fallthrough -Wno-comment -Wmisleading-indentation -ffunction-sections -fdata-sections -o CMakeFiles/cmTC_95227.dir/CheckSymbolExists.c.o -c /home/koti/buildroot-desktop/buildroot/output/build/host-llvm-15.0.0/buildroot-build/CMakeFiles/CMakeTmp/CheckSymbolExists.c
/home/koti/buildroot-desktop/buildroot/output/build/host-llvm-15.0.0/buildroot-build/CMakeFiles/CMakeTmp/CheckSymbolExists.c:2:10: fatal error: os/signpost.h: No such file or directory
2 | #include <os/signpost.h>
| ^~~~~~~~~~~~~~~
compilation terminated.
gmake[3]: *** [CMakeFiles/cmTC_95227.dir/build.make:78: CMakeFiles/cmTC_95227.dir/CheckSymbolExists.c.o] Error 1
gmake[3]: Leaving directory ‘/home/koti/buildroot-desktop/buildroot/output/build/host-llvm-15.0.0/buildroot-build/CMakeFiles/CMakeTmp’
gmake[2]: *** [Makefile:127: cmTC_95227/fast] Error 2
gmake[2]: Leaving directory ‘/home/koti/buildroot-desktop/buildroot/output/build/host-llvm-15.0.0/buildroot-build/CMakeFiles/CMakeTmp’

File /home/koti/buildroot-desktop/buildroot/output/build/host-llvm-15.0.0/buildroot-build/CMakeFiles/CMakeTmp/CheckSymbolExists.c:
/* */
#include <os/signpost.h>

int main(int argc, char** argv)
{
(void)argv;
#ifndef os_signpost_interval_begin
return ((int*)(&os_signpost_interval_begin))[argc];
#else
(void)argc;
return 0;
#endif
}
Performing C++ SOURCE FILE Test HAS_WERROR_GLOBAL_CTORS failed with the following output:
Change Dir: /home/koti/buildroot-desktop/buildroot/output/build/host-llvm-15.0.0/buildroot-build/CMakeFiles/CMakeTmp

Run Build Command(s):/usr/bin/gmake -f Makefile cmTC_03d2a/fast && gmake[2]: Entering directory ‘/home/koti/buildroot-desktop/buildroot/output/build/host-llvm-15.0.0/buildroot-build/CMakeFiles/CMakeTmp’
/usr/bin/gmake -f CMakeFiles/cmTC_03d2a.dir/build.make CMakeFiles/cmTC_03d2a.dir/build
gmake[3]: Entering directory ‘/home/koti/buildroot-desktop/buildroot/output/build/host-llvm-15.0.0/buildroot-build/CMakeFiles/CMakeTmp’
Building CXX object CMakeFiles/cmTC_03d2a.dir/src.cxx.o
/usr/bin/g++ -DHAS_WERROR_GLOBAL_CTORS -O2 -I/home/koti/buildroot-desktop/buildroot/output/host/include -fPIC -fno-semantic-interposition -fvisibility-inlines-hidden -Werror=date-time -Wall -Wextra -Wno-unused-parameter -Wwrite-strings -Wcast-qual -Wno-missing-field-initializers -pedantic -Wno-long-long -Wimplicit-fallthrough -Wno-maybe-uninitialized -Wno-class-memaccess -Wno-redundant-move -Wno-pessimizing-move -Wno-noexcept-type -Wdelete-non-virtual-dtor -Wsuggest-override -Wno-comment -Wmisleading-indentation -ffunction-sections -fdata-sections -Werror=global-constructors -std=c++14 -o CMakeFiles/cmTC_03d2a.dir/src.cxx.o -c /home/koti/buildroot-desktop/buildroot/output/build/host-llvm-15.0.0/buildroot-build/CMakeFiles/CMakeTmp/src.cxx
cc1plus: error: ‘-Werror=global-constructors’: no option ‘-Wglobal-constructors’; did you mean ‘-felide-constructors’?
gmake[3]: *** [CMakeFiles/cmTC_03d2a.dir/build.make:78: CMakeFiles/cmTC_03d2a.dir/src.cxx.o] Error 1
gmake[3]: Leaving directory ‘/home/koti/buildroot-desktop/buildroot/output/build/host-llvm-15.0.0/buildroot-build/CMakeFiles/CMakeTmp’
gmake[2]: *** [Makefile:127: cmTC_03d2a/fast] Error 2
gmake[2]: Leaving directory ‘/home/koti/buildroot-desktop/buildroot/output/build/host-llvm-15.0.0/buildroot-build/CMakeFiles/CMakeTmp’

Source file was:
int main() { return 0; }

Please find cMakeoutput log:

{{
The system is: Linux - 5.15.0-46-generic - x86_64
Compiling the C compiler identification source file “CMakeCCompilerId.c” succeeded.
Compiler: /usr/bin/gcc
Build flags: -O2;-I/home/koti/buildroot-desktop/buildroot/output/host/include
Id flags:

The output was:
0

Compilation of the C compiler identification source “CMakeCCompilerId.c” produced “a.out”

The C compiler identification is GNU, found in “/home/koti/buildroot-desktop/buildroot/output/build/host-llvm-15.0.0/buildroot-build/CMakeFiles/3.22.1/CompilerIdC/a.out”

Compiling the CXX compiler identification source file “CMakeCXXCompilerId.cpp” succeeded.
Compiler: /usr/bin/g++
Build flags: -O2;-I/home/koti/buildroot-desktop/buildroot/output/host/include
Id flags:

The output was:
0

Compilation of the CXX compiler identification source “CMakeCXXCompilerId.cpp” produced “a.out”

The CXX compiler identification is GNU, found in “/home/koti/buildroot-desktop/buildroot/output/build/host-llvm-15.0.0/buildroot-build/CMakeFiles/3.22.1/CompilerIdCXX/a.out”

Checking whether the ASM compiler is GNU using “–version” matched “(GNU assembler)|(GCC)|(Free Software Foundation)”:
GNU assembler (GNU Binutils for Ubuntu) 2.38
Copyright (C) 2022 Free Software Foundation, Inc.
This program is free software; you may redistribute it under the terms of
the GNU General Public License version 3 or later.
This program has absolutely no warranty.
This assembler was configured for a target of `x86_64-linux-gnu’.
Detecting C compiler ABI info compiled with the following output:
Change Dir: /home/koti/buildroot-desktop/buildroot/output/build/host-llvm-15.0.0/buildroot-build/CMakeFiles/CMakeTmp

Run Build Command(s):/usr/bin/gmake -f Makefile cmTC_3fde0/fast && gmake[2]: Entering directory ‘/home/koti/buildroot-desktop/buildroot/output/build/host-llvm-15.0.0/buildroot-build/CMakeFiles/CMakeTmp’
/usr/bin/gmake -f CMakeFiles/cmTC_3fde0.dir/build.make CMakeFiles/cmTC_3fde0.dir/build
gmake[3]: Entering directory ‘/home/koti/buildroot-desktop/buildroot/output/build/host-llvm-15.0.0/buildroot-build/CMakeFiles/CMakeTmp’
Building C object CMakeFiles/cmTC_3fde0.dir/CMakeCCompilerABI.c.o
/usr/bin/gcc -O2 -I/home/koti/buildroot-desktop/buildroot/output/host/include -v -o CMakeFiles/cmTC_3fde0.dir/CMakeCCompilerABI.c.o -c /usr/share/cmake-3.22/Modules/CMakeCCompilerABI.c
Using built-in specs.
COLLECT_GCC=/usr/bin/gcc
OFFLOAD_TARGET_NAMES=nvptx-none:amdgcn-amdhsa
OFFLOAD_TARGET_DEFAULT=1
Target: x86_64-linux-gnu
Configured with: …/src/configure -v --with-pkgversion=‘Ubuntu 11.2.0-19ubuntu1’ --with-bugurl=file:///usr/share/doc/gcc-11/README.Bugs --enable-languages=c,ada,c++,go,brig,d,fortran,objc,obj-c++,m2 --prefix=/usr --with-gcc-major-version-only --program-suffix=-11 --program-prefix=x86_64-linux-gnu- --enable-shared --enable-linker-build-id --libexecdir=/usr/lib --without-included-gettext --enable-threads=posix --libdir=/usr/lib --enable-nls --enable-bootstrap --enable-clocale=gnu --enable-libstdcxx-debug --enable-libstdcxx-time=yes --with-default-libstdcxx-abi=new --enable-gnu-unique-object --disable-vtable-verify --enable-plugin --enable-default-pie --with-system-zlib --enable-libphobos-checking=release --with-target-system-zlib=auto --enable-objc-gc=auto --enable-multiarch --disable-werror --enable-cet --with-arch-32=i686 --with-abi=m64 --with-multilib-list=m32,m64,mx32 --enable-multilib --with-tune=generic --enable-offload-targets=nvptx-none=/build/gcc-11-gBFGDP/gcc-11-11.2.0/debian/tmp-nvptx/usr,amdgcn-amdhsa=/build/gcc-11-gBFGDP/gcc-11-11.2.0/debian/tmp-gcn/usr --without-cuda-driver --enable-checking=release --build=x86_64-linux-gnu --host=x86_64-linux-gnu --target=x86_64-linux-gnu --with-build-config=bootstrap-lto-lean --enable-link-serialization=2
Thread model: posix
Supported LTO compression algorithms: zlib zstd
gcc version 11.2.0 (Ubuntu 11.2.0-19ubuntu1)
COLLECT_GCC_OPTIONS=‘-O2’ ‘-I’ ‘/home/koti/buildroot-desktop/buildroot/output/host/include’ ‘-v’ ‘-o’ ‘CMakeFiles/cmTC_3fde0.dir/CMakeCCompilerABI.c.o’ ‘-c’ ‘-mtune=generic’ ‘-march=x86-64’ ‘-dumpdir’ ‘CMakeFiles/cmTC_3fde0.dir/’
/usr/lib/gcc/x86_64-linux-gnu/11/cc1 -quiet -v -I /home/koti/buildroot-desktop/buildroot/output/host/include -imultiarch x86_64-linux-gnu /usr/share/cmake-3.22/Modules/CMakeCCompilerABI.c -quiet -dumpdir CMakeFiles/cmTC_3fde0.dir/ -dumpbase CMakeCCompilerABI.c.c -dumpbase-ext .c -mtune=generic -march=x86-64 -O2 -version -fasynchronous-unwind-tables -fstack-protector-strong -Wformat -Wformat-security -fstack-clash-protection -fcf-protection -o /tmp/ccTTIMwj.s
GNU C17 (Ubuntu 11.2.0-19ubuntu1) version 11.2.0 (x86_64-linux-gnu)
compiled by GNU C version 11.2.0, GMP version 6.2.1, MPFR version 4.1.0, MPC version 1.2.1, isl version isl-0.24-GMP

GGC heuristics: --param ggc-min-expand=100 --param ggc-min-heapsize=131072
ignoring nonexistent directory “/usr/local/include/x86_64-linux-gnu”
ignoring nonexistent directory “/usr/lib/gcc/x86_64-linux-gnu/11/include-fixed”
ignoring nonexistent directory “/usr/lib/gcc/x86_64-linux-gnu/11/…/…/…/…/x86_64-linux-gnu/include”
#include “…” search starts here:
#include <…> search starts here:
/home/koti/buildroot-desktop/buildroot/output/host/include
/usr/lib/gcc/x86_64-linux-gnu/11/include
/usr/local/include
/usr/include/x86_64-linux-gnu
/usr/include
End of search list.
GNU C17 (Ubuntu 11.2.0-19ubuntu1) version 11.2.0 (x86_64-linux-gnu)
compiled by GNU C version 11.2.0, GMP version 6.2.1, MPFR version 4.1.0, MPC version 1.2.1, isl version isl-0.24-GMP

GGC heuristics: --param ggc-min-expand=100 --param ggc-min-heapsize=131072
Compiler executable checksum: ead6677a8de2192bf1e5ee7b28d13856
COLLECT_GCC_OPTIONS=‘-O2’ ‘-I’ ‘/home/koti/buildroot-desktop/buildroot/output/host/include’ ‘-v’ ‘-o’ ‘CMakeFiles/cmTC_3fde0.dir/CMakeCCompilerABI.c.o’ ‘-c’ ‘-mtune=generic’ ‘-march=x86-64’ ‘-dumpdir’ ‘CMakeFiles/cmTC_3fde0.dir/’
as -v -I /home/koti/buildroot-desktop/buildroot/output/host/include --64 -o CMakeFiles/cmTC_3fde0.dir/CMakeCCompilerABI.c.o /tmp/ccTTIMwj.s
GNU assembler version 2.38 (x86_64-linux-gnu) using BFD version (GNU Binutils for Ubuntu) 2.38
COMPILER_PATH=/usr/lib/gcc/x86_64-linux-gnu/11/:/usr/lib/gcc/x86_64-linux-gnu/11/:/usr/lib/gcc/x86_64-linux-gnu/:/usr/lib/gcc/x86_64-linux-gnu/11/:/usr/lib/gcc/x86_64-linux-gnu/
LIBRARY_PATH=/usr/lib/gcc/x86_64-linux-gnu/11/:/usr/lib/gcc/x86_64-linux-gnu/11/…/…/…/x86_64-linux-gnu/:/usr/lib/gcc/x86_64-linux-gnu/11/…/…/…/…/lib/:/lib/x86_64-linux-gnu/:/lib/…/lib/:/usr/lib/x86_64-linux-gnu/:/usr/lib/…/lib/:/usr/lib/gcc/x86_64-linux-gnu/11/…/…/…/:/lib/:/usr/lib/
COLLECT_GCC_OPTIONS=‘-O2’ ‘-I’ ‘/home/koti/buildroot-desktop/buildroot/output/host/include’ ‘-v’ ‘-o’ ‘CMakeFiles/cmTC_3fde0.dir/CMakeCCompilerABI.c.o’ ‘-c’ ‘-mtune=generic’ ‘-march=x86-64’ ‘-dumpdir’ ‘CMakeFiles/cmTC_3fde0.dir/CMakeCCompilerABI.c.’
Linking C executable cmTC_3fde0
/usr/bin/cmake -E cmake_link_script CMakeFiles/cmTC_3fde0.dir/link.txt --verbose=1
/usr/bin/gcc -O2 -I/home/koti/buildroot-desktop/buildroot/output/host/include -L/home/koti/buildroot-desktop/buildroot/output/host/lib -Wl,-rpath,/home/koti/buildroot-desktop/buildroot/output/host/lib -v CMakeFiles/cmTC_3fde0.dir/CMakeCCompilerABI.c.o -o cmTC_3fde0
Using built-in specs.
COLLECT_GCC=/usr/bin/gcc
COLLECT_LTO_WRAPPER=/usr/lib/gcc/x86_64-linux-gnu/11/lto-wrapper
OFFLOAD_TARGET_NAMES=nvptx-none:amdgcn-amdhsa
OFFLOAD_TARGET_DEFAULT=1
Target: x86_64-linux-gnu
Configured with: …/src/configure -v --with-pkgversion=‘Ubuntu 11.2.0-19ubuntu1’ --with-bugurl=file:///usr/share/doc/gcc-11/README.Bugs --enable-languages=c,ada,c++,go,brig,d,fortran,objc,obj-c++,m2 --prefix=/usr --with-gcc-major-version-only --program-suffix=-11 --program-prefix=x86_64-linux-gnu- --enable-shared --enable-linker-build-id --libexecdir=/usr/lib --without-included-gettext --enable-threads=posix --libdir=/usr/lib --enable-nls --enable-bootstrap --enable-clocale=gnu --enable-libstdcxx-debug --enable-libstdcxx-time=yes --with-default-libstdcxx-abi=new --enable-gnu-unique-object --disable-vtable-verify --enable-plugin --enable-default-pie --with-system-zlib --enable-libphobos-checking=release --with-target-system-zlib=auto --enable-objc-gc=auto --enable-multiarch --disable-werror --enable-cet --with-arch-32=i686 --with-abi=m64 --with-multilib-list=m32,m64,mx32 --enable-multilib --with-tune=generic --enable-offload-targets=nvptx-none=/build/gcc-11-gBFGDP/gcc-11-11.2.0/debian/tmp-nvptx/usr,amdgcn-amdhsa=/build/gcc-11-gBFGDP/gcc-11-11.2.0/debian/tmp-gcn/usr --without-cuda-driver --enable-checking=release --build=x86_64-linux-gnu --host=x86_64-linux-gnu --target=x86_64-linux-gnu --with-build-config=bootstrap-lto-lean --enable-link-serialization=2
Thread model: posix
Supported LTO compression algorithms: zlib zstd
gcc version 11.2.0 (Ubuntu 11.2.0-19ubuntu1)
COMPILER_PATH=/usr/lib/gcc/x86_64-linux-gnu/11/:/usr/lib/gcc/x86_64-linux-gnu/11/:/usr/lib/gcc/x86_64-linux-gnu/:/usr/lib/gcc/x86_64-linux-gnu/11/:/usr/lib/gcc/x86_64-linux-gnu/
LIBRARY_PATH=/usr/lib/gcc/x86_64-linux-gnu/11/:/usr/lib/gcc/x86_64-linux-gnu/11/…/…/…/x86_64-linux-gnu/:/usr/lib/gcc/x86_64-linux-gnu/11/…/…/…/…/lib/:/lib/x86_64-linux-gnu/:/lib/…/lib/:/usr/lib/x86_64-linux-gnu/:/usr/lib/…/lib/:/usr/lib/gcc/x86_64-linux-gnu/11/…/…/…/:/lib/:/usr/lib/
COLLECT_GCC_OPTIONS=‘-O2’ ‘-I’ ‘/home/koti/buildroot-desktop/buildroot/output/host/include’ ‘-L/home/koti/buildroot-desktop/buildroot/output/host/lib’ ‘-v’ ‘-o’ ‘cmTC_3fde0’ ‘-mtune=generic’ ‘-march=x86-64’ ‘-dumpdir’ ‘cmTC_3fde0.’
/usr/lib/gcc/x86_64-linux-gnu/11/collect2 -plugin /usr/lib/gcc/x86_64-linux-gnu/11/liblto_plugin.so -plugin-opt=/usr/lib/gcc/x86_64-linux-gnu/11/lto-wrapper -plugin-opt=-fresolution=/tmp/cc1pFDqk.res -plugin-opt=-pass-through=-lgcc -plugin-opt=-pass-through=-lgcc_s -plugin-opt=-pass-through=-lc -plugin-opt=-pass-through=-lgcc -plugin-opt=-pass-through=-lgcc_s --build-id --eh-frame-hdr -m elf_x86_64 --hash-style=gnu --as-needed -dynamic-linker /lib64/ld-linux-x86-64.so.2 -pie -z now -z relro -o cmTC_3fde0 /usr/lib/gcc/x86_64-linux-gnu/11/…/…/…/x86_64-linux-gnu/Scrt1.o /usr/lib/gcc/x86_64-linux-gnu/11/…/…/…/x86_64-linux-gnu/crti.o /usr/lib/gcc/x86_64-linux-gnu/11/crtbeginS.o -L/home/koti/buildroot-desktop/buildroot/output/host/lib -L/usr/lib/gcc/x86_64-linux-gnu/11 -L/usr/lib/gcc/x86_64-linux-gnu/11/…/…/…/x86_64-linux-gnu -L/usr/lib/gcc/x86_64-linux-gnu/11/…/…/…/…/lib -L/lib/x86_64-linux-gnu -L/lib/…/lib -L/usr/lib/x86_64-linux-gnu -L/usr/lib/…/lib -L/usr/lib/gcc/x86_64-linux-gnu/11/…/…/… -rpath /home/koti/buildroot-desktop/buildroot/output/host/lib CMakeFiles/cmTC_3fde0.dir/CMakeCCompilerABI.c.o -lgcc --push-state --as-needed -lgcc_s --pop-state -lc -lgcc --push-state --as-needed -lgcc_s --pop-state /usr/lib/gcc/x86_64-linux-gnu/11/crtendS.o /usr/lib/gcc/x86_64-linux-gnu/11/…/…/…/x86_64-linux-gnu/crtn.o
COLLECT_GCC_OPTIONS=‘-O2’ ‘-I’ ‘/home/koti/buildroot-desktop/buildroot/output/host/include’ ‘-L/home/koti/buildroot-desktop/buildroot/output/host/lib’ ‘-v’ ‘-o’ ‘cmTC_3fde0’ ‘-mtune=generic’ ‘-march=x86-64’ ‘-dumpdir’ ‘cmTC_3fde0.’
gmake[3]: Leaving directory ‘/home/koti/buildroot-desktop/buildroot/output/build/host-llvm-15.0.0/buildroot-build/CMakeFiles/CMakeTmp’
gmake[2]: Leaving directory ‘/home/koti/buildroot-desktop/buildroot/output/build/host-llvm-15.0.0/buildroot-build/CMakeFiles/CMakeTmp’

Parsed C implicit include dir info from above output: rv=done
found start of include info
found start of implicit include info
add: [/home/koti/buildroot-desktop/buildroot/output/host/include]
add: [/usr/lib/gcc/x86_64-linux-gnu/11/include]
add: [/usr/local/include]
add: [/usr/include/x86_64-linux-gnu]
add: [/usr/include]
end of search list found
collapse include dir [/home/koti/buildroot-desktop/buildroot/output/host/include] ==> [/home/koti/buildroot-desktop/buildroot/output/host/include]
collapse include dir [/usr/lib/gcc/x86_64-linux-gnu/11/include] ==> [/usr/lib/gcc/x86_64-linux-gnu/11/include]
collapse include dir [/usr/local/include] ==> [/usr/local/include]
collapse include dir [/usr/include/x86_64-linux-gnu] ==> [/usr/include/x86_64-linux-gnu]
collapse include dir [/usr/include] ==> [/usr/include]
implicit include dirs: [/home/koti/buildroot-desktop/buildroot/output/host/include;/usr/lib/gcc/x86_64-linux-gnu/11/include;/usr/local/include;/usr/include/x86_64-linux-gnu;/usr/include]

Parsed C implicit link information from above output:
link line regex: [^( |.[/])(ld|CMAKE_LINK_STARTFILE-NOTFOUND|([^/]±)?ld|collect2)[^/]*( |$)]
ignore line: [Change Dir: /home/koti/buildroot-desktop/buildroot/output/build/host-llvm-15.0.0/buildroot-build/CMakeFiles/CMakeTmp]
ignore line:
ignore line: [Run Build Command(s):/usr/bin/gmake -f Makefile cmTC_3fde0/fast && gmake[2]: Entering directory ‘/home/koti/buildroot-desktop/buildroot/output/build/host-llvm-15.0.0/buildroot-build/CMakeFiles/CMakeTmp’]
ignore line: [/usr/bin/gmake -f CMakeFiles/cmTC_3fde0.dir/build.make CMakeFiles/cmTC_3fde0.dir/build]
ignore line: [gmake[3]: Entering directory ‘/home/koti/buildroot-desktop/buildroot/output/build/host-llvm-15.0.0/buildroot-build/CMakeFiles/CMakeTmp’]
ignore line: [Building C object CMakeFiles/cmTC_3fde0.dir/CMakeCCompilerABI.c.o]
ignore line: [/usr/bin/gcc -O2 -I/home/koti/buildroot-desktop/buildroot/output/host/include -v -o CMakeFiles/cmTC_3fde0.dir/CMakeCCompilerABI.c.o -c /usr/share/cmake-3.22/Modules/CMakeCCompilerABI.c]
ignore line: [Using built-in specs.]
ignore line: [COLLECT_GCC=/usr/bin/gcc]
ignore line: [OFFLOAD_TARGET_NAMES=nvptx-none:amdgcn-amdhsa]
ignore line: [OFFLOAD_TARGET_DEFAULT=1]
ignore line: [Target: x86_64-linux-gnu]
ignore line: [Configured with: …/src/configure -v --with-pkgversion=‘Ubuntu 11.2.0-19ubuntu1’ --with-bugurl=file:///usr/share/doc/gcc-11/README.Bugs --enable-languages=c ada c++ go brig d fortran objc obj-c++ m2 --prefix=/usr --with-gcc-major-version-only --program-suffix=-11 --program-prefix=x86_64-linux-gnu- --enable-shared --enable-linker-build-id --libexecdir=/usr/lib --without-included-gettext --enable-threads=posix --libdir=/usr/lib --enable-nls --enable-bootstrap --enable-clocale=gnu --enable-libstdcxx-debug --enable-libstdcxx-time=yes --with-default-libstdcxx-abi=new --enable-gnu-unique-object --disable-vtable-verify --enable-plugin --enable-default-pie --with-system-zlib --enable-libphobos-checking=release --with-target-system-zlib=auto --enable-objc-gc=auto --enable-multiarch --disable-werror --enable-cet --with-arch-32=i686 --with-abi=m64 --with-multilib-list=m32 m64 mx32 --enable-multilib --with-tune=generic --enable-offload-targets=nvptx-none=/build/gcc-11-gBFGDP/gcc-11-11.2.0/debian/tmp-nvptx/usr amdgcn-amdhsa=/build/gcc-11-gBFGDP/gcc-11-11.2.0/debian/tmp-gcn/usr --without-cuda-driver --enable-checking=release --build=x86_64-linux-gnu --host=x86_64-linux-gnu --target=x86_64-linux-gnu --with-build-config=bootstrap-lto-lean --enable-link-serialization=2]
ignore line: [Thread model: posix]
ignore line: [Supported LTO compression algorithms: zlib zstd]
ignore line: [gcc version 11.2.0 (Ubuntu 11.2.0-19ubuntu1) ]
ignore line: [COLLECT_GCC_OPTIONS=‘-O2’ ‘-I’ ‘/home/koti/buildroot-desktop/buildroot/output/host/include’ ‘-v’ ‘-o’ ‘CMakeFiles/cmTC_3fde0.dir/CMakeCCompilerABI.c.o’ ‘-c’ ‘-mtune=generic’ ‘-march=x86-64’ ‘-dumpdir’ ‘CMakeFiles/cmTC_3fde0.dir/’]
ignore line: [ /usr/lib/gcc/x86_64-linux-gnu/11/cc1 -quiet -v -I /home/koti/buildroot-desktop/buildroot/output/host/include -imultiarch x86_64-linux-gnu /usr/share/cmake-3.22/Modules/CMakeCCompilerABI.c -quiet -dumpdir CMakeFiles/cmTC_3fde0.dir/ -dumpbase CMakeCCompilerABI.c.c -dumpbase-ext .c -mtune=generic -march=x86-64 -O2 -version -fasynchronous-unwind-tables -fstack-protector-strong -Wformat -Wformat-security -fstack-clash-protection -fcf-protection -o /tmp/ccTTIMwj.s]
ignore line: [GNU C17 (Ubuntu 11.2.0-19ubuntu1) version 11.2.0 (x86_64-linux-gnu)]
ignore line: [ compiled by GNU C version 11.2.0 GMP version 6.2.1 MPFR version 4.1.0 MPC version 1.2.1 isl version isl-0.24-GMP]
ignore line:
ignore line: [GGC heuristics: --param ggc-min-expand=100 --param ggc-min-heapsize=131072]
ignore line: [ignoring nonexistent directory “/usr/local/include/x86_64-linux-gnu”]
ignore line: [ignoring nonexistent directory “/usr/lib/gcc/x86_64-linux-gnu/11/include-fixed”]
ignore line: [ignoring nonexistent directory “/usr/lib/gcc/x86_64-linux-gnu/11/…/…/…/…/x86_64-linux-gnu/include”]
ignore line: [#include “…” search starts here:]
ignore line: [#include <…> search starts here:]
ignore line: [ /home/koti/buildroot-desktop/buildroot/output/host/include]
ignore line: [ /usr/lib/gcc/x86_64-linux-gnu/11/include]
ignore line: [ /usr/local/include]
ignore line: [ /usr/include/x86_64-linux-gnu]
ignore line: [ /usr/include]
ignore line: [End of search list.]
ignore line: [GNU C17 (Ubuntu 11.2.0-19ubuntu1) version 11.2.0 (x86_64-linux-gnu)]
ignore line: [ compiled by GNU C version 11.2.0 GMP version 6.2.1 MPFR version 4.1.0 MPC version 1.2.1 isl version isl-0.24-GMP]
ignore line:
ignore line: [GGC heuristics: --param ggc-min-expand=100 --param ggc-min-heapsize=131072]
ignore line: [Compiler executable checksum: ead6677a8de2192bf1e5ee7b28d13856]
ignore line: [COLLECT_GCC_OPTIONS=‘-O2’ ‘-I’ ‘/home/koti/buildroot-desktop/buildroot/output/host/include’ ‘-v’ ‘-o’ ‘CMakeFiles/cmTC_3fde0.dir/CMakeCCompilerABI.c.o’ ‘-c’ ‘-mtune=generic’ ‘-march=x86-64’ ‘-dumpdir’ ‘CMakeFiles/cmTC_3fde0.dir/’]
ignore line: [ as -v -I /home/koti/buildroot-desktop/buildroot/output/host/include --64 -o CMakeFiles/cmTC_3fde0.dir/CMakeCCompilerABI.c.o /tmp/ccTTIMwj.s]
ignore line: [GNU assembler version 2.38 (x86_64-linux-gnu) using BFD version (GNU Binutils for Ubuntu) 2.38]
ignore line: [COMPILER_PATH=/usr/lib/gcc/x86_64-linux-gnu/11/:/usr/lib/gcc/x86_64-linux-gnu/11/:/usr/lib/gcc/x86_64-linux-gnu/:/usr/lib/gcc/x86_64-linux-gnu/11/:/usr/lib/gcc/x86_64-linux-gnu/]
ignore line: [LIBRARY_PATH=/usr/lib/gcc/x86_64-linux-gnu/11/:/usr/lib/gcc/x86_64-linux-gnu/11/…/…/…/x86_64-linux-gnu/:/usr/lib/gcc/x86_64-linux-gnu/11/…/…/…/…/lib/:/lib/x86_64-linux-gnu/:/lib/…/lib/:/usr/lib/x86_64-linux-gnu/:/usr/lib/…/lib/:/usr/lib/gcc/x86_64-linux-gnu/11/…/…/…/:/lib/:/usr/lib/]
ignore line: [COLLECT_GCC_OPTIONS=‘-O2’ ‘-I’ ‘/home/koti/buildroot-desktop/buildroot/output/host/include’ ‘-v’ ‘-o’ ‘CMakeFiles/cmTC_3fde0.dir/CMakeCCompilerABI.c.o’ ‘-c’ ‘-mtune=generic’ ‘-march=x86-64’ ‘-dumpdir’ ‘CMakeFiles/cmTC_3fde0.dir/CMakeCCompilerABI.c.’]
ignore line: [Linking C executable cmTC_3fde0]
ignore line: [/usr/bin/cmake -E cmake_link_script CMakeFiles/cmTC_3fde0.dir/link.txt --verbose=1]
ignore line: [/usr/bin/gcc -O2 -I/home/koti/buildroot-desktop/buildroot/output/host/include -L/home/koti/buildroot-desktop/buildroot/output/host/lib -Wl -rpath /home/koti/buildroot-desktop/buildroot/output/host/lib -v CMakeFiles/cmTC_3fde0.dir/CMakeCCompilerABI.c.o -o cmTC_3fde0 ]
ignore line: [Using built-in specs.]
ignore line: [COLLECT_GCC=/usr/bin/gcc]
ignore line: [COLLECT_LTO_WRAPPER=/usr/lib/gcc/x86_64-linux-gnu/11/lto-wrapper]
ignore line: [OFFLOAD_TARGET_NAMES=nvptx-none:amdgcn-amdhsa]
ignore line: [OFFLOAD_TARGET_DEFAULT=1]
ignore line: [Target: x86_64-linux-gnu]
ignore line: [Configured with: …/src/configure -v --with-pkgversion=‘Ubuntu 11.2.0-19ubuntu1’ --with-bugurl=file:///usr/share/doc/gcc-11/README.Bugs --enable-languages=c ada c++ go brig d fortran objc obj-c++ m2 --prefix=/usr --with-gcc-major-version-only --program-suffix=-11 --program-prefix=x86_64-linux-gnu- --enable-shared --enable-linker-build-id --libexecdir=/usr/lib --without-included-gettext --enable-threads=posix --libdir=/usr/lib --enable-nls --enable-bootstrap --enable-clocale=gnu --enable-libstdcxx-debug --enable-libstdcxx-time=yes --with-default-libstdcxx-abi=new --enable-gnu-unique-object --disable-vtable-verify --enable-plugin --enable-default-pie --with-system-zlib --enable-libphobos-checking=release --with-target-system-zlib=auto --enable-objc-gc=auto --enable-multiarch --disable-werror --enable-cet --with-arch-32=i686 --with-abi=m64 --with-multilib-list=m32 m64 mx32 --enable-multilib --with-tune=generic --enable-offload-targets=nvptx-none=/build/gcc-11-gBFGDP/gcc-11-11.2.0/debian/tmp-nvptx/usr amdgcn-amdhsa=/build/gcc-11-gBFGDP/gcc-11-11.2.0/debian/tmp-gcn/usr --without-cuda-driver --enable-checking=release --build=x86_64-linux-gnu --host=x86_64-linux-gnu --target=x86_64-linux-gnu --with-build-config=bootstrap-lto-lean --enable-link-serialization=2]
ignore line: [Thread model: posix]
ignore line: [Supported LTO compression algorithms: zlib zstd]
ignore line: [gcc version 11.2.0 (Ubuntu 11.2.0-19ubuntu1) ]
ignore line: [COMPILER_PATH=/usr/lib/gcc/x86_64-linux-gnu/11/:/usr/lib/gcc/x86_64-linux-gnu/11/:/usr/lib/gcc/x86_64-linux-gnu/:/usr/lib/gcc/x86_64-linux-gnu/11/:/usr/lib/gcc/x86_64-linux-gnu/]
ignore line: [LIBRARY_PATH=/usr/lib/gcc/x86_64-linux-gnu/11/:/usr/lib/gcc/x86_64-linux-gnu/11/…/…/…/x86_64-linux-gnu/:/usr/lib/gcc/x86_64-linux-gnu/11/…/…/…/…/lib/:/lib/x86_64-linux-gnu/:/lib/…/lib/:/usr/lib/x86_64-linux-gnu/:/usr/lib/…/lib/:/usr/lib/gcc/x86_64-linux-gnu/11/…/…/…/:/lib/:/usr/lib/]
ignore line: [COLLECT_GCC_OPTIONS=‘-O2’ ‘-I’ ‘/home/koti/buildroot-desktop/buildroot/output/host/include’ ‘-L/home/koti/buildroot-desktop/buildroot/output/host/lib’ ‘-v’ ‘-o’ ‘cmTC_3fde0’ ‘-mtune=generic’ ‘-march=x86-64’ ‘-dumpdir’ ‘cmTC_3fde0.’]
link line: [ /usr/lib/gcc/x86_64-linux-gnu/11/collect2 -plugin /usr/lib/gcc/x86_64-linux-gnu/11/liblto_plugin.so -plugin-opt=/usr/lib/gcc/x86_64-linux-gnu/11/lto-wrapper -plugin-opt=-fresolution=/tmp/cc1pFDqk.res -plugin-opt=-pass-through=-lgcc -plugin-opt=-pass-through=-lgcc_s -plugin-opt=-pass-through=-lc -plugin-opt=-pass-through=-lgcc -plugin-opt=-pass-through=-lgcc_s --build-id --eh-frame-hdr -m elf_x86_64 --hash-style=gnu --as-needed -dynamic-linker /lib64/ld-linux-x86-64.so.2 -pie -z now -z relro -o cmTC_3fde0 /usr/lib/gcc/x86_64-linux-gnu/11/…/…/…/x86_64-linux-gnu/Scrt1.o /usr/lib/gcc/x86_64-linux-gnu/11/…/…/…/x86_64-linux-gnu/crti.o /usr/lib/gcc/x86_64-linux-gnu/11/crtbeginS.o -L/home/koti/buildroot-desktop/buildroot/output/host/lib -L/usr/lib/gcc/x86_64-linux-gnu/11 -L/usr/lib/gcc/x86_64-linux-gnu/11/…/…/…/x86_64-linux-gnu -L/usr/lib/gcc/x86_64-linux-gnu/11/…/…/…/…/lib -L/lib/x86_64-linux-gnu -L/lib/…/lib -L/usr/lib/x86_64-linux-gnu -L/usr/lib/…/lib -L/usr/lib/gcc/x86_64-linux-gnu/11/…/…/… -rpath /home/koti/buildroot-desktop/buildroot/output/host/lib CMakeFiles/cmTC_3fde0.dir/CMakeCCompilerABI.c.o -lgcc --push-state --as-needed -lgcc_s --pop-state -lc -lgcc --push-state --as-needed -lgcc_s --pop-state /usr/lib/gcc/x86_64-linux-gnu/11/crtendS.o /usr/lib/gcc/x86_64-linux-gnu/11/…/…/…/x86_64-linux-gnu/crtn.o]
arg [/usr/lib/gcc/x86_64-linux-gnu/11/collect2] ==> ignore
arg [-plugin] ==> ignore
arg [/usr/lib/gcc/x86_64-linux-gnu/11/liblto_plugin.so] ==> ignore
arg [-plugin-opt=/usr/lib/gcc/x86_64-linux-gnu/11/lto-wrapper] ==> ignore
arg [-plugin-opt=-fresolution=/tmp/cc1pFDqk.res] ==> ignore
arg [-plugin-opt=-pass-through=-lgcc] ==> ignore
arg [-plugin-opt=-pass-through=-lgcc_s] ==> ignore
arg [-plugin-opt=-pass-through=-lc] ==> ignore
arg [-plugin-opt=-pass-through=-lgcc] ==> ignore
arg [-plugin-opt=-pass-through=-lgcc_s] ==> ignore
arg [–build-id] ==> ignore
arg [–eh-frame-hdr] ==> ignore
arg [-m] ==> ignore
arg [elf_x86_64] ==> ignore
arg [–hash-style=gnu] ==> ignore
arg [–as-needed] ==> ignore
arg [-dynamic-linker] ==> ignore
arg [/lib64/ld-linux-x86-64.so.2] ==> ignore
arg [-pie] ==> ignore
arg [-znow] ==> ignore
arg [-zrelro] ==> ignore
arg [-o] ==> ignore
arg [cmTC_3fde0] ==> ignore
arg [/usr/lib/gcc/x86_64-linux-gnu/11/…/…/…/x86_64-linux-gnu/Scrt1.o] ==> obj [/usr/lib/gcc/x86_64-linux-gnu/11/…/…/…/x86_64-linux-gnu/Scrt1.o]
arg [/usr/lib/gcc/x86_64-linux-gnu/11/…/…/…/x86_64-linux-gnu/crti.o] ==> obj [/usr/lib/gcc/x86_64-linux-gnu/11/…/…/…/x86_64-linux-gnu/crti.o]
arg [/usr/lib/gcc/x86_64-linux-gnu/11/crtbeginS.o] ==> obj [/usr/lib/gcc/x86_64-linux-gnu/11/crtbeginS.o]
arg [-L/home/koti/buildroot-desktop/buildroot/output/host/lib] ==> dir [/home/koti/buildroot-desktop/buildroot/output/host/lib]
arg [-L/usr/lib/gcc/x86_64-linux-gnu/11] ==> dir [/usr/lib/gcc/x86_64-linux-gnu/11]
arg [-L/usr/lib/gcc/x86_64-linux-gnu/11/…/…/…/x86_64-linux-gnu] ==> dir [/usr/lib/gcc/x86_64-linux-gnu/11/…/…/…/x86_64-linux-gnu]
arg [-L/usr/lib/gcc/x86_64-linux-gnu/11/…/…/…/…/lib] ==> dir [/usr/lib/gcc/x86_64-linux-gnu/11/…/…/…/…/lib]
arg [-L/lib/x86_64-linux-gnu] ==> dir [/lib/x86_64-linux-gnu]
arg [-L/lib/…/lib] ==> dir [/lib/…/lib]
arg [-L/usr/lib/x86_64-linux-gnu] ==> dir [/usr/lib/x86_64-linux-gnu]
arg [-L/usr/lib/…/lib] ==> dir [/usr/lib/…/lib]
arg [-L/usr/lib/gcc/x86_64-linux-gnu/11/…/…/…] ==> dir [/usr/lib/gcc/x86_64-linux-gnu/11/…/…/…]
arg [-rpath] ==> ignore
arg [/home/koti/buildroot-desktop/buildroot/output/host/lib] ==> ignore
arg [CMakeFiles/cmTC_3fde0.dir/CMakeCCompilerABI.c.o] ==> ignore
arg [-lgcc] ==> lib [gcc]
arg [–push-state] ==> ignore
arg [–as-needed] ==> ignore
arg [-lgcc_s] ==> lib [gcc_s]
arg [–pop-state] ==> ignore
arg [-lc] ==> lib [c]
arg [-lgcc] ==> lib [gcc]
arg [–push-state] ==> ignore
arg [–as-needed] ==> ignore
arg [-lgcc_s] ==> lib [gcc_s]
arg [–pop-state] ==> ignore
arg [/usr/lib/gcc/x86_64-linux-gnu/11/crtendS.o] ==> obj [/usr/lib/gcc/x86_64-linux-gnu/11/crtendS.o]
arg [/usr/lib/gcc/x86_64-linux-gnu/11/…/…/…/x86_64-linux-gnu/crtn.o] ==> obj [/usr/lib/gcc/x86_64-linux-gnu/11/…/…/…/x86_64-linux-gnu/crtn.o]
collapse obj [/usr/lib/gcc/x86_64-linux-gnu/11/…/…/…/x86_64-linux-gnu/Scrt1.o] ==> [/usr/lib/x86_64-linux-gnu/Scrt1.o]
collapse obj [/usr/lib/gcc/x86_64-linux-gnu/11/…/…/…/x86_64-linux-gnu/crti.o] ==> [/usr/lib/x86_64-linux-gnu/crti.o]
collapse obj [/usr/lib/gcc/x86_64-linux-gnu/11/…/…/…/x86_64-linux-gnu/crtn.o] ==> [/usr/lib/x86_64-linux-gnu/crtn.o]
collapse library dir [/home/koti/buildroot-desktop/buildroot/output/host/lib] ==> [/home/koti/buildroot-desktop/buildroot/output/host/lib]
collapse library dir [/usr/lib/gcc/x86_64-linux-gnu/11] ==> [/usr/lib/gcc/x86_64-linux-gnu/11]
collapse library dir [/usr/lib/gcc/x86_64-linux-gnu/11/…/…/…/x86_64-linux-gnu] ==> [/usr/lib/x86_64-linux-gnu]
collapse library dir [/usr/lib/gcc/x86_64-linux-gnu/11/…/…/…/…/lib] ==> [/usr/lib]
collapse library dir [/lib/x86_64-linux-gnu] ==> [/lib/x86_64-linux-gnu]
collapse library dir [/lib/…/lib] ==> [/lib]
collapse library dir [/usr/lib/x86_64-linux-gnu] ==> [/usr/lib/x86_64-linux-gnu]
collapse library dir [/usr/lib/…/lib] ==> [/usr/lib]
collapse library dir [/usr/lib/gcc/x86_64-linux-gnu/11/…/…/…] ==> [/usr/lib]
implicit libs: [gcc;gcc_s;c;gcc;gcc_s]
implicit objs: [/usr/lib/x86_64-linux-gnu/Scrt1.o;/usr/lib/x86_64-linux-gnu/crti.o;/usr/lib/gcc/x86_64-linux-gnu/11/crtbeginS.o;/usr/lib/gcc/x86_64-linux-gnu/11/crtendS.o;/usr/lib/x86_64-linux-gnu/crtn.o]
implicit dirs: [/home/koti/buildroot-desktop/buildroot/output/host/lib;/usr/lib/gcc/x86_64-linux-gnu/11;/usr/lib/x86_64-linux-gnu;/usr/lib;/lib/x86_64-linux-gnu;/lib]
implicit fwks:

Detecting CXX compiler ABI info compiled with the following output:
Change Dir: /home/koti/buildroot-desktop/buildroot/output/build/host-llvm-15.0.0/buildroot-build/CMakeFiles/CMakeTmp

Run Build Command(s):/usr/bin/gmake -f Makefile cmTC_47c6a/fast && gmake[2]: Entering directory ‘/home/koti/buildroot-desktop/buildroot/output/build/host-llvm-15.0.0/buildroot-build/CMakeFiles/CMakeTmp’
/usr/bin/gmake -f CMakeFiles/cmTC_47c6a.dir/build.make CMakeFiles/cmTC_47c6a.dir/build
gmake[3]: Entering directory ‘/home/koti/buildroot-desktop/buildroot/output/build/host-llvm-15.0.0/buildroot-build/CMakeFiles/CMakeTmp’
Building CXX object CMakeFiles/cmTC_47c6a.dir/CMakeCXXCompilerABI.cpp.o
/usr/bin/g++ -O2 -I/home/koti/buildroot-desktop/buildroot/output/host/include -v -o CMakeFiles/cmTC_47c6a.dir/CMakeCXXCompilerABI.cpp.o -c /usr/share/cmake-3.22/Modules/CMakeCXXCompilerABI.cpp
Using built-in specs.
COLLECT_GCC=/usr/bin/g++
OFFLOAD_TARGET_NAMES=nvptx-none:amdgcn-amdhsa
OFFLOAD_TARGET_DEFAULT=1
Target: x86_64-linux-gnu
Configured with: …/src/configure -v --with-pkgversion=‘Ubuntu 11.2.0-19ubuntu1’ --with-bugurl=file:///usr/share/doc/gcc-11/README.Bugs --enable-languages=c,ada,c++,go,brig,d,fortran,objc,obj-c++,m2 --prefix=/usr --with-gcc-major-version-only --program-suffix=-11 --program-prefix=x86_64-linux-gnu- --enable-shared --enable-linker-build-id --libexecdir=/usr/lib --without-included-gettext --enable-threads=posix --libdir=/usr/lib --enable-nls --enable-bootstrap --enable-clocale=gnu --enable-libstdcxx-debug --enable-libstdcxx-time=yes --with-default-libstdcxx-abi=new --enable-gnu-unique-object --disable-vtable-verify --enable-plugin --enable-default-pie --with-system-zlib --enable-libphobos-checking=release --with-target-system-zlib=auto --enable-objc-gc=auto --enable-multiarch --disable-werror --enable-cet --with-arch-32=i686 --with-abi=m64 --with-multilib-list=m32,m64,mx32 --enable-multilib --with-tune=generic --enable-offload-targets=nvptx-none=/build/gcc-11-gBFGDP/gcc-11-11.2.0/debian/tmp-nvptx/usr,amdgcn-amdhsa=/build/gcc-11-gBFGDP/gcc-11-11.2.0/debian/tmp-gcn/usr --without-cuda-driver --enable-checking=release --build=x86_64-linux-gnu --host=x86_64-linux-gnu --target=x86_64-linux-gnu --with-build-config=bootstrap-lto-lean --enable-link-serialization=2
Thread model: posix
Supported LTO compression algorithms: zlib zstd
gcc version 11.2.0 (Ubuntu 11.2.0-19ubuntu1)
COLLECT_GCC_OPTIONS=‘-O2’ ‘-I’ ‘/home/koti/buildroot-desktop/buildroot/output/host/include’ ‘-v’ ‘-o’ ‘CMakeFiles/cmTC_47c6a.dir/CMakeCXXCompilerABI.cpp.o’ ‘-c’ ‘-shared-libgcc’ ‘-mtune=generic’ ‘-march=x86-64’ ‘-dumpdir’ ‘CMakeFiles/cmTC_47c6a.dir/’
/usr/lib/gcc/x86_64-linux-gnu/11/cc1plus -quiet -v -I /home/koti/buildroot-desktop/buildroot/output/host/include -imultiarch x86_64-linux-gnu -D_GNU_SOURCE /usr/share/cmake-3.22/Modules/CMakeCXXCompilerABI.cpp -quiet -dumpdir CMakeFiles/cmTC_47c6a.dir/ -dumpbase CMakeCXXCompilerABI.cpp.cpp -dumpbase-ext .cpp -mtune=generic -march=x86-64 -O2 -version -fasynchronous-unwind-tables -fstack-protector-strong -Wformat -Wformat-security -fstack-clash-protection -fcf-protection -o /tmp/ccQ0HXT8.s
GNU C++17 (Ubuntu 11.2.0-19ubuntu1) version 11.2.0 (x86_64-linux-gnu)
compiled by GNU C version 11.2.0, GMP version 6.2.1, MPFR version 4.1.0, MPC version 1.2.1, isl version isl-0.24-GMP

GGC heuristics: --param ggc-min-expand=100 --param ggc-min-heapsize=131072
ignoring duplicate directory “/usr/include/x86_64-linux-gnu/c++/11”
ignoring nonexistent directory “/usr/local/include/x86_64-linux-gnu”
ignoring nonexistent directory “/usr/lib/gcc/x86_64-linux-gnu/11/include-fixed”
ignoring nonexistent directory “/usr/lib/gcc/x86_64-linux-gnu/11/…/…/…/…/x86_64-linux-gnu/include”
#include “…” search starts here:
#include <…> search starts here:
/home/koti/buildroot-desktop/buildroot/output/host/include
/usr/include/c++/11
/usr/include/x86_64-linux-gnu/c++/11
/usr/include/c++/11/backward
/usr/lib/gcc/x86_64-linux-gnu/11/include
/usr/local/include
/usr/include/x86_64-linux-gnu
/usr/include
End of search list.
GNU C++17 (Ubuntu 11.2.0-19ubuntu1) version 11.2.0 (x86_64-linux-gnu)
compiled by GNU C version 11.2.0, GMP version 6.2.1, MPFR version 4.1.0, MPC version 1.2.1, isl version isl-0.24-GMP

GGC heuristics: --param ggc-min-expand=100 --param ggc-min-heapsize=131072
Compiler executable checksum: 619370d92bf6efc3023abfa7394da0c1
COLLECT_GCC_OPTIONS=‘-O2’ ‘-I’ ‘/home/koti/buildroot-desktop/buildroot/output/host/include’ ‘-v’ ‘-o’ ‘CMakeFiles/cmTC_47c6a.dir/CMakeCXXCompilerABI.cpp.o’ ‘-c’ ‘-shared-libgcc’ ‘-mtune=generic’ ‘-march=x86-64’ ‘-dumpdir’ ‘CMakeFiles/cmTC_47c6a.dir/’
as -v -I /home/koti/buildroot-desktop/buildroot/output/host/include --64 -o CMakeFiles/cmTC_47c6a.dir/CMakeCXXCompilerABI.cpp.o /tmp/ccQ0HXT8.s
GNU assembler version 2.38 (x86_64-linux-gnu) using BFD version (GNU Binutils for Ubuntu) 2.38
COMPILER_PATH=/usr/lib/gcc/x86_64-linux-gnu/11/:/usr/lib/gcc/x86_64-linux-gnu/11/:/usr/lib/gcc/x86_64-linux-gnu/:/usr/lib/gcc/x86_64-linux-gnu/11/:/usr/lib/gcc/x86_64-linux-gnu/
LIBRARY_PATH=/usr/lib/gcc/x86_64-linux-gnu/11/:/usr/lib/gcc/x86_64-linux-gnu/11/…/…/…/x86_64-linux-gnu/:/usr/lib/gcc/x86_64-linux-gnu/11/…/…/…/…/lib/:/lib/x86_64-linux-gnu/:/lib/…/lib/:/usr/lib/x86_64-linux-gnu/:/usr/lib/…/lib/:/usr/lib/gcc/x86_64-linux-gnu/11/…/…/…/:/lib/:/usr/lib/
COLLECT_GCC_OPTIONS=‘-O2’ ‘-I’ ‘/home/koti/buildroot-desktop/buildroot/output/host/include’ ‘-v’ ‘-o’ ‘CMakeFiles/cmTC_47c6a.dir/CMakeCXXCompilerABI.cpp.o’ ‘-c’ ‘-shared-libgcc’ ‘-mtune=generic’ ‘-march=x86-64’ ‘-dumpdir’ ‘CMakeFiles/cmTC_47c6a.dir/CMakeCXXCompilerABI.cpp.’
Linking CXX executable cmTC_47c6a
/usr/bin/cmake -E cmake_link_script CMakeFiles/cmTC_47c6a.dir/link.txt --verbose=1
/usr/bin/g++ -O2 -I/home/koti/buildroot-desktop/buildroot/output/host/include -L/home/koti/buildroot-desktop/buildroot/output/host/lib -Wl,-rpath,/home/koti/buildroot-desktop/buildroot/output/host/lib -v CMakeFiles/cmTC_47c6a.dir/CMakeCXXCompilerABI.cpp.o -o cmTC_47c6a
Using built-in specs.
COLLECT_GCC=/usr/bin/g++
COLLECT_LTO_WRAPPER=/usr/lib/gcc/x86_64-linux-gnu/11/lto-wrapper
OFFLOAD_TARGET_NAMES=nvptx-none:amdgcn-amdhsa
OFFLOAD_TARGET_DEFAULT=1
Target: x86_64-linux-gnu
Configured with: …/src/configure -v --with-pkgversion=‘Ubuntu 11.2.0-19ubuntu1’ --with-bugurl=file:///usr/share/doc/gcc-11/README.Bugs --enable-languages=c,ada,c++,go,brig,d,fortran,objc,obj-c++,m2 --prefix=/usr --with-gcc-major-version-only --program-suffix=-11 --program-prefix=x86_64-linux-gnu- --enable-shared --enable-linker-build-id --libexecdir=/usr/lib --without-included-gettext --enable-threads=posix --libdir=/usr/lib --enable-nls --enable-bootstrap --enable-clocale=gnu --enable-libstdcxx-debug --enable-libstdcxx-time=yes --with-default-libstdcxx-abi=new --enable-gnu-unique-object --disable-vtable-verify --enable-plugin --enable-default-pie --with-system-zlib --enable-libphobos-checking=release --with-target-system-zlib=auto --enable-objc-gc=auto --enable-multiarch --disable-werror --enable-cet --with-arch-32=i686 --with-abi=m64 --with-multilib-list=m32,m64,mx32 --enable-multilib --with-tune=generic --enable-offload-targets=nvptx-none=/build/gcc-11-gBFGDP/gcc-11-11.2.0/debian/tmp-nvptx/usr,amdgcn-amdhsa=/build/gcc-11-gBFGDP/gcc-11-11.2.0/debian/tmp-gcn/usr --without-cuda-driver --enable-checking=release --build=x86_64-linux-gnu --host=x86_64-linux-gnu --target=x86_64-linux-gnu --with-build-config=bootstrap-lto-lean --enable-link-serialization=2
Thread model: posix
Supported LTO compression algorithms: zlib zstd
gcc version 11.2.0 (Ubuntu 11.2.0-19ubuntu1)
COMPILER_PATH=/usr/lib/gcc/x86_64-linux-gnu/11/:/usr/lib/gcc/x86_64-linux-gnu/11/:/usr/lib/gcc/x86_64-linux-gnu/:/usr/lib/gcc/x86_64-linux-gnu/11/:/usr/lib/gcc/x86_64-linux-gnu/
LIBRARY_PATH=/usr/lib/gcc/x86_64-linux-gnu/11/:/usr/lib/gcc/x86_64-linux-gnu/11/…/…/…/x86_64-linux-gnu/:/usr/lib/gcc/x86_64-linux-gnu/11/…/…/…/…/lib/:/lib/x86_64-linux-gnu/:/lib/…/lib/:/usr/lib/x86_64-linux-gnu/:/usr/lib/…/lib/:/usr/lib/gcc/x86_64-linux-gnu/11/…/…/…/:/lib/:/usr/lib/
COLLECT_GCC_OPTIONS=‘-O2’ ‘-I’ ‘/home/koti/buildroot-desktop/buildroot/output/host/include’ ‘-L/home/koti/buildroot-desktop/buildroot/output/host/lib’ ‘-v’ ‘-o’ ‘cmTC_47c6a’ ‘-shared-libgcc’ ‘-mtune=generic’ ‘-march=x86-64’ ‘-dumpdir’ ‘cmTC_47c6a.’
/usr/lib/gcc/x86_64-linux-gnu/11/collect2 -plugin /usr/lib/gcc/x86_64-linux-gnu/11/liblto_plugin.so -plugin-opt=/usr/lib/gcc/x86_64-linux-gnu/11/lto-wrapper -plugin-opt=-fresolution=/tmp/ccNoGtWL.res -plugin-opt=-pass-through=-lgcc_s -plugin-opt=-pass-through=-lgcc -plugin-opt=-pass-through=-lc -plugin-opt=-pass-through=-lgcc_s -plugin-opt=-pass-through=-lgcc --build-id --eh-frame-hdr -m elf_x86_64 --hash-style=gnu --as-needed -dynamic-linker /lib64/ld-linux-x86-64.so.2 -pie -z now -z relro -o cmTC_47c6a /usr/lib/gcc/x86_64-linux-gnu/11/…/…/…/x86_64-linux-gnu/Scrt1.o /usr/lib/gcc/x86_64-linux-gnu/11/…/…/…/x86_64-linux-gnu/crti.o /usr/lib/gcc/x86_64-linux-gnu/11/crtbeginS.o -L/home/koti/buildroot-desktop/buildroot/output/host/lib -L/usr/lib/gcc/x86_64-linux-gnu/11 -L/usr/lib/gcc/x86_64-linux-gnu/11/…/…/…/x86_64-linux-gnu -L/usr/lib/gcc/x86_64-linux-gnu/11/…/…/…/…/lib -L/lib/x86_64-linux-gnu -L/lib/…/lib -L/usr/lib/x86_64-linux-gnu -L/usr/lib/…/lib -L/usr/lib/gcc/x86_64-linux-gnu/11/…/…/… -rpath /home/koti/buildroot-desktop/buildroot/output/host/lib CMakeFiles/cmTC_47c6a.dir/CMakeCXXCompilerABI.cpp.o -lstdc++ -lm -lgcc_s -lgcc -lc -lgcc_s -lgcc /usr/lib/gcc/x86_64-linux-gnu/11/crtendS.o /usr/lib/gcc/x86_64-linux-gnu/11/…/…/…/x86_64-linux-gnu/crtn.o
COLLECT_GCC_OPTIONS=‘-O2’ ‘-I’ ‘/home/koti/buildroot-desktop/buildroot/output/host/include’ ‘-L/home/koti/buildroot-desktop/buildroot/output/host/lib’ ‘-v’ ‘-o’ ‘cmTC_47c6a’ ‘-shared-libgcc’ ‘-mtune=generic’ ‘-march=x86-64’ ‘-dumpdir’ ‘cmTC_47c6a.’
gmake[3]: Leaving directory ‘/home/koti/buildroot-desktop/buildroot/output/build/host-llvm-15.0.0/buildroot-build/CMakeFiles/CMakeTmp’
gmake[2]: Leaving directory ‘/home/koti/buildroot-desktop/buildroot/output/build/host-llvm-15.0.0/buildroot-build/CMakeFiles/CMakeTmp’

Parsed CXX implicit include dir info from above output: rv=done
found start of include info
found start of implicit include info
add: [/home/koti/buildroot-desktop/buildroot/output/host/include]
add: [/usr/include/c++/11]
add: [/usr/include/x86_64-linux-gnu/c++/11]
add: [/usr/include/c++/11/backward]
add: [/usr/lib/gcc/x86_64-linux-gnu/11/include]
add: [/usr/local/include]
add: [/usr/include/x86_64-linux-gnu]
add: [/usr/include]
end of search list found
collapse include dir [/home/koti/buildroot-desktop/buildroot/output/host/include] ==> [/home/koti/buildroot-desktop/buildroot/output/host/include]
collapse include dir [/usr/include/c++/11] ==> [/usr/include/c++/11]
collapse include dir [/usr/include/x86_64-linux-gnu/c++/11] ==> [/usr/include/x86_64-linux-gnu/c++/11]
collapse include dir [/usr/include/c++/11/backward] ==> [/usr/include/c++/11/backward]
collapse include dir [/usr/lib/gcc/x86_64-linux-gnu/11/include] ==> [/usr/lib/gcc/x86_64-linux-gnu/11/include]
collapse include dir [/usr/local/include] ==> [/usr/local/include]
collapse include dir [/usr/include/x86_64-linux-gnu] ==> [/usr/include/x86_64-linux-gnu]
collapse include dir [/usr/include] ==> [/usr/include]
implicit include dirs: [/home/koti/buildroot-desktop/buildroot/output/host/include;/usr/include/c++/11;/usr/include/x86_64-linux-gnu/c++/11;/usr/include/c++/11/backward;/usr/lib/gcc/x86_64-linux-gnu/11/include;/usr/local/include;/usr/include/x86_64-linux-gnu;/usr/include]

Parsed CXX implicit link information from above output:
link line regex: [^( |.[/])(ld|CMAKE_LINK_STARTFILE-NOTFOUND|([^/]±)?ld|collect2)[^/]*( |$)]
ignore line: [Change Dir: /home/koti/buildroot-desktop/buildroot/output/build/host-llvm-15.0.0/buildroot-build/CMakeFiles/CMakeTmp]
ignore line:
ignore line: [Run Build Command(s):/usr/bin/gmake -f Makefile cmTC_47c6a/fast && gmake[2]: Entering directory ‘/home/koti/buildroot-desktop/buildroot/output/build/host-llvm-15.0.0/buildroot-build/CMakeFiles/CMakeTmp’]
ignore line: [/usr/bin/gmake -f CMakeFiles/cmTC_47c6a.dir/build.make CMakeFiles/cmTC_47c6a.dir/build]
ignore line: [gmake[3]: Entering directory ‘/home/koti/buildroot-desktop/buildroot/output/build/host-llvm-15.0.0/buildroot-build/CMakeFiles/CMakeTmp’]
ignore line: [Building CXX object CMakeFiles/cmTC_47c6a.dir/CMakeCXXCompilerABI.cpp.o]
ignore line: [/usr/bin/g++ -O2 -I/home/koti/buildroot-desktop/buildroot/output/host/include -v -o CMakeFiles/cmTC_47c6a.dir/CMakeCXXCompilerABI.cpp.o -c /usr/share/cmake-3.22/Modules/CMakeCXXCompilerABI.cpp]
ignore line: [Using built-in specs.]
ignore line: [COLLECT_GCC=/usr/bin/g++]
ignore line: [OFFLOAD_TARGET_NAMES=nvptx-none:amdgcn-amdhsa]
ignore line: [OFFLOAD_TARGET_DEFAULT=1]
ignore line: [Target: x86_64-linux-gnu]
ignore line: [Configured with: …/src/configure -v --with-pkgversion=‘Ubuntu 11.2.0-19ubuntu1’ --with-bugurl=file:///usr/share/doc/gcc-11/README.Bugs --enable-languages=c ada c++ go brig d fortran objc obj-c++ m2 --prefix=/usr --with-gcc-major-version-only --program-suffix=-11 --program-prefix=x86_64-linux-gnu- --enable-shared --enable-linker-build-id --libexecdir=/usr/lib --without-included-gettext --enable-threads=posix --libdir=/usr/lib --enable-nls --enable-bootstrap --enable-clocale=gnu --enable-libstdcxx-debug --enable-libstdcxx-time=yes --with-default-libstdcxx-abi=new --enable-gnu-unique-object --disable-vtable-verify --enable-plugin --enable-default-pie --with-system-zlib --enable-libphobos-checking=release --with-target-system-zlib=auto --enable-objc-gc=auto --enable-multiarch --disable-werror --enable-cet --with-arch-32=i686 --with-abi=m64 --with-multilib-list=m32 m64 mx32 --enable-multilib --with-tune=generic --enable-offload-targets=nvptx-none=/build/gcc-11-gBFGDP/gcc-11-11.2.0/debian/tmp-nvptx/usr amdgcn-amdhsa=/build/gcc-11-gBFGDP/gcc-11-11.2.0/debian/tmp-gcn/usr --without-cuda-driver --enable-checking=release --build=x86_64-linux-gnu --host=x86_64-linux-gnu --target=x86_64-linux-gnu --with-build-config=bootstrap-lto-lean --enable-link-serialization=2]
ignore line: [Thread model: posix]
ignore line: [Supported LTO compression algorithms: zlib zstd]
ignore line: [gcc version 11.2.0 (Ubuntu 11.2.0-19ubuntu1) ]
ignore line: [COLLECT_GCC_OPTIONS=‘-O2’ ‘-I’ ‘/home/koti/buildroot-desktop/buildroot/output/host/include’ ‘-v’ ‘-o’ ‘CMakeFiles/cmTC_47c6a.dir/CMakeCXXCompilerABI.cpp.o’ ‘-c’ ‘-shared-libgcc’ ‘-mtune=generic’ ‘-march=x86-64’ ‘-dumpdir’ ‘CMakeFiles/cmTC_47c6a.dir/’]
ignore line: [ /usr/lib/gcc/x86_64-linux-gnu/11/cc1plus -quiet -v -I /home/koti/buildroot-desktop/buildroot/output/host/include -imultiarch x86_64-linux-gnu -D_GNU_SOURCE /usr/share/cmake-3.22/Modules/CMakeCXXCompilerABI.cpp -quiet -dumpdir CMakeFiles/cmTC_47c6a.dir/ -dumpbase CMakeCXXCompilerABI.cpp.cpp -dumpbase-ext .cpp -mtune=generic -march=x86-64 -O2 -version -fasynchronous-unwind-tables -fstack-protector-strong -Wformat -Wformat-security -fstack-clash-protection -fcf-protection -o /tmp/ccQ0HXT8.s]
ignore line: [GNU C++17 (Ubuntu 11.2.0-19ubuntu1) version 11.2.0 (x86_64-linux-gnu)]
ignore line: [ compiled by GNU C version 11.2.0 GMP version 6.2.1 MPFR version 4.1.0 MPC version 1.2.1 isl version isl-0.24-GMP]
ignore line:
ignore line: [GGC heuristics: --param ggc-min-expand=100 --param ggc-min-heapsize=131072]
ignore line: [ignoring duplicate directory “/usr/include/x86_64-linux-gnu/c++/11”]
ignore line: [ignoring nonexistent directory “/usr/local/include/x86_64-linux-gnu”]
ignore line: [ignoring nonexistent directory “/usr/lib/gcc/x86_64-linux-gnu/11/include-fixed”]
ignore line: [ignoring nonexistent directory “/usr/lib/gcc/x86_64-linux-gnu/11/…/…/…/…/x86_64-linux-gnu/include”]
ignore line: [#include “…” search starts here:]
ignore line: [#include <…> search starts here:]
ignore line: [ /home/koti/buildroot-desktop/buildroot/output/host/include]
ignore line: [ /usr/include/c++/11]
ignore line: [ /usr/include/x86_64-linux-gnu/c++/11]
ignore line: [ /usr/include/c++/11/backward]
ignore line: [ /usr/lib/gcc/x86_64-linux-gnu/11/include]
ignore line: [ /usr/local/include]
ignore line: [ /usr/include/x86_64-linux-gnu]
ignore line: [ /usr/include]
ignore line: [End of search list.]
ignore line: [GNU C++17 (Ubuntu 11.2.0-19ubuntu1) version 11.2.0 (x86_64-linux-gnu)]
ignore line: [ compiled by GNU C version 11.2.0 GMP version 6.2.1 MPFR version 4.1.0 MPC version 1.2.1 isl version isl-0.24-GMP]
ignore line:
ignore line: [GGC heuristics: --param ggc-min-expand=100 --param ggc-min-heapsize=131072]
ignore line: [Compiler executable checksum: 619370d92bf6efc3023abfa7394da0c1]
ignore line: [COLLECT_GCC_OPTIONS=‘-O2’ ‘-I’ ‘/home/koti/buildroot-desktop/buildroot/output/host/include’ ‘-v’ ‘-o’ ‘CMakeFiles/cmTC_47c6a.dir/CMakeCXXCompilerABI.cpp.o’ ‘-c’ ‘-shared-libgcc’ ‘-mtune=generic’ ‘-march=x86-64’ ‘-dumpdir’ ‘CMakeFiles/cmTC_47c6a.dir/’]
ignore line: [ as -v -I /home/koti/buildroot-desktop/buildroot/output/host/include --64 -o CMakeFiles/cmTC_47c6a.dir/CMakeCXXCompilerABI.cpp.o /tmp/ccQ0HXT8.s]
ignore line: [GNU assembler version 2.38 (x86_64-linux-gnu) using BFD version (GNU Binutils for Ubuntu) 2.38]
ignore line: [COMPILER_PATH=/usr/lib/gcc/x86_64-linux-gnu/11/:/usr/lib/gcc/x86_64-linux-gnu/11/:/usr/lib/gcc/x86_64-linux-gnu/:/usr/lib/gcc/x86_64-linux-gnu/11/:/usr/lib/gcc/x86_64-linux-gnu/]
ignore line: [LIBRARY_PATH=/usr/lib/gcc/x86_64-linux-gnu/11/:/usr/lib/gcc/x86_64-linux-gnu/11/…/…/…/x86_64-linux-gnu/:/usr/lib/gcc/x86_64-linux-gnu/11/…/…/…/…/lib/:/lib/x86_64-linux-gnu/:/lib/…/lib/:/usr/lib/x86_64-linux-gnu/:/usr/lib/…/lib/:/usr/lib/gcc/x86_64-linux-gnu/11/…/…/…/:/lib/:/usr/lib/]
ignore line: [COLLECT_GCC_OPTIONS=‘-O2’ ‘-I’ ‘/home/koti/buildroot-desktop/buildroot/output/host/include’ ‘-v’ ‘-o’ ‘CMakeFiles/cmTC_47c6a.dir/CMakeCXXCompilerABI.cpp.o’ ‘-c’ ‘-shared-libgcc’ ‘-mtune=generic’ ‘-march=x86-64’ ‘-dumpdir’ ‘CMakeFiles/cmTC_47c6a.dir/CMakeCXXCompilerABI.cpp.’]
ignore line: [Linking CXX executable cmTC_47c6a]
ignore line: [/usr/bin/cmake -E cmake_link_script CMakeFiles/cmTC_47c6a.dir/link.txt --verbose=1]
ignore line: [/usr/bin/g++ -O2 -I/home/koti/buildroot-desktop/buildroot/output/host/include -L/home/koti/buildroot-desktop/buildroot/output/host/lib -Wl -rpath /home/koti/buildroot-desktop/buildroot/output/host/lib -v CMakeFiles/cmTC_47c6a.dir/CMakeCXXCompilerABI.cpp.o -o cmTC_47c6a ]
ignore line: [Using built-in specs.]
ignore line: [COLLECT_GCC=/usr/bin/g++]
ignore line: [COLLECT_LTO_WRAPPER=/usr/lib/gcc/x86_64-linux-gnu/11/lto-wrapper]
ignore line: [OFFLOAD_TARGET_NAMES=nvptx-none:amdgcn-amdhsa]
ignore line: [OFFLOAD_TARGET_DEFAULT=1]
ignore line: [Target: x86_64-linux-gnu]
ignore line: [Configured with: …/src/configure -v --with-pkgversion=‘Ubuntu 11.2.0-19ubuntu1’ --with-bugurl=file:///usr/share/doc/gcc-11/README.Bugs --enable-languages=c ada c++ go brig d fortran objc obj-c++ m2 --prefix=/usr --with-gcc-major-version-only --program-suffix=-11 --program-prefix=x86_64-linux-gnu- --enable-shared --enable-linker-build-id --libexecdir=/usr/lib --without-included-gettext --enable-threads=posix --libdir=/usr/lib --enable-nls --enable-bootstrap --enable-clocale=gnu --enable-libstdcxx-debug --enable-libstdcxx-time=yes --with-default-libstdcxx-abi=new --enable-gnu-unique-object --disable-vtable-verify --enable-plugin --enable-default-pie --with-system-zlib --enable-libphobos-checking=release --with-target-system-zlib=auto --enable-objc-gc=auto --enable-multiarch --disable-werror --enable-cet --with-arch-32=i686 --with-abi=m64 --with-multilib-list=m32 m64 mx32 --enable-multilib --with-tune=generic --enable-offload-targets=nvptx-none=/build/gcc-11-gBFGDP/gcc-11-11.2.0/debian/tmp-nvptx/usr amdgcn-amdhsa=/build/gcc-11-gBFGDP/gcc-11-11.2.0/debian/tmp-gcn/usr --without-cuda-driver --enable-checking=release --build=x86_64-linux-gnu --host=x86_64-linux-gnu --target=x86_64-linux-gnu --with-build-config=bootstrap-lto-lean --enable-link-serialization=2]
ignore line: [Thread model: posix]
ignore line: [Supported LTO compression algorithms: zlib zstd]
ignore line: [gcc version 11.2.0 (Ubuntu 11.2.0-19ubuntu1) ]
ignore line: [COMPILER_PATH=/usr/lib/gcc/x86_64-linux-gnu/11/:/usr/lib/gcc/x86_64-linux-gnu/11/:/usr/lib/gcc/x86_64-linux-gnu/:/usr/lib/gcc/x86_64-linux-gnu/11/:/usr/lib/gcc/x86_64-linux-gnu/]
ignore line: [LIBRARY_PATH=/usr/lib/gcc/x86_64-linux-gnu/11/:/usr/lib/gcc/x86_64-linux-gnu/11/…/…/…/x86_64-linux-gnu/:/usr/lib/gcc/x86_64-linux-gnu/11/…/…/…/…/lib/:/lib/x86_64-linux-gnu/:/lib/…/lib/:/usr/lib/x86_64-linux-gnu/:/usr/lib/…/lib/:/usr/lib/gcc/x86_64-linux-gnu/11/…/…/…/:/lib/:/usr/lib/]
ignore line: [COLLECT_GCC_OPTIONS=‘-O2’ ‘-I’ ‘/home/koti/buildroot-desktop/buildroot/output/host/include’ ‘-L/home/koti/buildroot-desktop/buildroot/output/host/lib’ ‘-v’ ‘-o’ ‘cmTC_47c6a’ ‘-shared-libgcc’ ‘-mtune=generic’ ‘-march=x86-64’ ‘-dumpdir’ ‘cmTC_47c6a.’]
link line: [ /usr/lib/gcc/x86_64-linux-gnu/11/collect2 -plugin /usr/lib/gcc/x86_64-linux-gnu/11/liblto_plugin.so -plugin-opt=/usr/lib/gcc/x86_64-linux-gnu/11/lto-wrapper -plugin-opt=-fresolution=/tmp/ccNoGtWL.res -plugin-opt=-pass-through=-lgcc_s -plugin-opt=-pass-through=-lgcc -plugin-opt=-pass-through=-lc -plugin-opt=-pass-through=-lgcc_s -plugin-opt=-pass-through=-lgcc --build-id --eh-frame-hdr -m elf_x86_64 --hash-style=gnu --as-needed -dynamic-linker /lib64/ld-linux-x86-64.so.2 -pie -z now -z relro -o cmTC_47c6a /usr/lib/gcc/x86_64-linux-gnu/11/…/…/…/x86_64-linux-gnu/Scrt1.o /usr/lib/gcc/x86_64-linux-gnu/11/…/…/…/x86_64-linux-gnu/crti.o /usr/lib/gcc/x86_64-linux-gnu/11/crtbeginS.o -L/home/koti/buildroot-desktop/buildroot/output/host/lib -L/usr/lib/gcc/x86_64-linux-gnu/11 -L/usr/lib/gcc/x86_64-linux-gnu/11/…/…/…/x86_64-linux-gnu -L/usr/lib/gcc/x86_64-linux-gnu/11/…/…/…/…/lib -L/lib/x86_64-linux-gnu -L/lib/…/lib -L/usr/lib/x86_64-linux-gnu -L/usr/lib/…/lib -L/usr/lib/gcc/x86_64-linux-gnu/11/…/…/… -rpath /home/koti/buildroot-desktop/buildroot/output/host/lib CMakeFiles/cmTC_47c6a.dir/CMakeCXXCompilerABI.cpp.o -lstdc++ -lm -lgcc_s -lgcc -lc -lgcc_s -lgcc /usr/lib/gcc/x86_64-linux-gnu/11/crtendS.o /usr/lib/gcc/x86_64-linux-gnu/11/…/…/…/x86_64-linux-gnu/crtn.o]
arg [/usr/lib/gcc/x86_64-linux-gnu/11/collect2] ==> ignore
arg [-plugin] ==> ignore
arg [/usr/lib/gcc/x86_64-linux-gnu/11/liblto_plugin.so] ==> ignore
arg [-plugin-opt=/usr/lib/gcc/x86_64-linux-gnu/11/lto-wrapper] ==> ignore
arg [-plugin-opt=-fresolution=/tmp/ccNoGtWL.res] ==> ignore
arg [-plugin-opt=-pass-through=-lgcc_s] ==> ignore
arg [-plugin-opt=-pass-through=-lgcc] ==> ignore
arg [-plugin-opt=-pass-through=-lc] ==> ignore
arg [-plugin-opt=-pass-through=-lgcc_s] ==> ignore
arg [-plugin-opt=-pass-through=-lgcc] ==> ignore
arg [–build-id] ==> ignore
arg [–eh-frame-hdr] ==> ignore
arg [-m] ==> ignore
arg [elf_x86_64] ==> ignore
arg [–hash-style=gnu] ==> ignore
arg [–as-needed] ==> ignore
arg [-dynamic-linker] ==> ignore
arg [/lib64/ld-linux-x86-64.so.2] ==> ignore
arg [-pie] ==> ignore
arg [-znow] ==> ignore
arg [-zrelro] ==> ignore
arg [-o] ==> ignore
arg [cmTC_47c6a] ==> ignore
arg [/usr/lib/gcc/x86_64-linux-gnu/11/…/…/…/x86_64-linux-gnu/Scrt1.o] ==> obj [/usr/lib/gcc/x86_64-linux-gnu/11/…/…/…/x86_64-linux-gnu/Scrt1.o]
arg [/usr/lib/gcc/x86_64-linux-gnu/11/…/…/…/x86_64-linux-gnu/crti.o] ==> obj [/usr/lib/gcc/x86_64-linux-gnu/11/…/…/…/x86_64-linux-gnu/crti.o]
arg [/usr/lib/gcc/x86_64-linux-gnu/11/crtbeginS.o] ==> obj [/usr/lib/gcc/x86_64-linux-gnu/11/crtbeginS.o]
arg [-L/home/koti/buildroot-desktop/buildroot/output/host/lib] ==> dir [/home/koti/buildroot-desktop/buildroot/output/host/lib]
arg [-L/usr/lib/gcc/x86_64-linux-gnu/11] ==> dir [/usr/lib/gcc/x86_64-linux-gnu/11]
arg [-L/usr/lib/gcc/x86_64-linux-gnu/11/…/…/…/x86_64-linux-gnu] ==> dir [/usr/lib/gcc/x86_64-linux-gnu/11/…/…/…/x86_64-linux-gnu]
arg [-L/usr/lib/gcc/x86_64-linux-gnu/11/…/…/…/…/lib] ==> dir [/usr/lib/gcc/x86_64-linux-gnu/11/…/…/…/…/lib]
arg [-L/lib/x86_64-linux-gnu] ==> dir [/lib/x86_64-linux-gnu]
arg [-L/lib/…/lib] ==> dir [/lib/…/lib]
arg [-L/usr/lib/x86_64-linux-gnu] ==> dir [/usr/lib/x86_64-linux-gnu]
arg [-L/usr/lib/…/lib] ==> dir [/usr/lib/…/lib]
arg [-L/usr/lib/gcc/x86_64-linux-gnu/11/…/…/…] ==> dir [/usr/lib/gcc/x86_64-linux-gnu/11/…/…/…]
arg [-rpath] ==> ignore
arg [/home/koti/buildroot-desktop/buildroot/output/host/lib] ==> ignore
arg [CMakeFiles/cmTC_47c6a.dir/CMakeCXXCompilerABI.cpp.o] ==> ignore
arg [-lstdc++] ==> lib [stdc++]
arg [-lm] ==> lib [m]
arg [-lgcc_s] ==> lib [gcc_s]
arg [-lgcc] ==> lib [gcc]
arg [-lc] ==> lib [c]
arg [-lgcc_s] ==> lib [gcc_s]
arg [-lgcc] ==> lib [gcc]
arg [/usr/lib/gcc/x86_64-linux-gnu/11/crtendS.o] ==> obj [/usr/lib/gcc/x86_64-linux-gnu/11/crtendS.o]
arg [/usr/lib/gcc/x86_64-linux-gnu/11/…/…/…/x86_64-linux-gnu/crtn.o] ==> obj [/usr/lib/gcc/x86_64-linux-gnu/11/…/…/…/x86_64-linux-gnu/crtn.o]
collapse obj [/usr/lib/gcc/x86_64-linux-gnu/11/…/…/…/x86_64-linux-gnu/Scrt1.o] ==> [/usr/lib/x86_64-linux-gnu/Scrt1.o]
collapse obj [/usr/lib/gcc/x86_64-linux-gnu/11/…/…/…/x86_64-linux-gnu/crti.o] ==> [/usr/lib/x86_64-linux-gnu/crti.o]
collapse obj [/usr/lib/gcc/x86_64-linux-gnu/11/…/…/…/x86_64-linux-gnu/crtn.o] ==> [/usr/lib/x86_64-linux-gnu/crtn.o]
collapse library dir [/home/koti/buildroot-desktop/buildroot/output/host/lib] ==> [/home/koti/buildroot-desktop/buildroot/output/host/lib]
collapse library dir [/usr/lib/gcc/x86_64-linux-gnu/11] ==> [/usr/lib/gcc/x86_64-linux-gnu/11]
collapse library dir [/usr/lib/gcc/x86_64-linux-gnu/11/…/…/…/x86_64-linux-gnu] ==> [/usr/lib/x86_64-linux-gnu]
collapse library dir [/usr/lib/gcc/x86_64-linux-gnu/11/…/…/…/…/lib] ==> [/usr/lib]
collapse library dir [/lib/x86_64-linux-gnu] ==> [/lib/x86_64-linux-gnu]
collapse library dir [/lib/…/lib] ==> [/lib]
collapse library dir [/usr/lib/x86_64-linux-gnu] ==> [/usr/lib/x86_64-linux-gnu]
collapse library dir [/usr/lib/…/lib] ==> [/usr/lib]
collapse library dir [/usr/lib/gcc/x86_64-linux-gnu/11/…/…/…] ==> [/usr/lib]
implicit libs: [stdc++;m;gcc_s;gcc;c;gcc_s;gcc]
implicit objs: [/usr/lib/x86_64-linux-gnu/Scrt1.o;/usr/lib/x86_64-linux-gnu/crti.o;/usr/lib/gcc/x86_64-linux-gnu/11/crtbeginS.o;/usr/lib/gcc/x86_64-linux-gnu/11/crtendS.o;/usr/lib/x86_64-linux-gnu/crtn.o]
implicit dirs: [/home/koti/buildroot-desktop/buildroot/output/host/lib;/usr/lib/gcc/x86_64-linux-gnu/11;/usr/lib/x86_64-linux-gnu;/usr/lib;/lib/x86_64-linux-gnu;/lib]
implicit fwks:

Determining if the include file dlfcn.h exists passed with the following output:
Change Dir: /home/koti/buildroot-desktop/buildroot/output/build/host-llvm-15.0.0/buildroot-build/CMakeFiles/CMakeTmp

Run Build Command(s):/usr/bin/gmake -f Makefile cmTC_7bb2e/fast && gmake[2]: Entering directory ‘/home/koti/buildroot-desktop/buildroot/output/build/host-llvm-15.0.0/buildroot-build/CMakeFiles/CMakeTmp’
/usr/bin/gmake -f CMakeFiles/cmTC_7bb2e.dir/build.make CMakeFiles/cmTC_7bb2e.dir/build
gmake[3]: Entering directory ‘/home/koti/buildroot-desktop/buildroot/output/build/host-llvm-15.0.0/buildroot-build/CMakeFiles/CMakeTmp’
Building C object CMakeFiles/cmTC_7bb2e.dir/CheckIncludeFile.c.o
/usr/bin/gcc -O2 -I/home/koti/buildroot-desktop/buildroot/output/host/include -o CMakeFiles/cmTC_7bb2e.dir/CheckIncludeFile.c.o -c /home/koti/buildroot-desktop/buildroot/output/build/host-llvm-15.0.0/buildroot-build/CMakeFiles/CMakeTmp/CheckIncludeFile.c
Linking C executable cmTC_7bb2e
/usr/bin/cmake -E cmake_link_script CMakeFiles/cmTC_7bb2e.dir/link.txt --verbose=1
/usr/bin/gcc -O2 -I/home/koti/buildroot-desktop/buildroot/output/host/include -L/home/koti/buildroot-desktop/buildroot/output/host/lib -Wl,-rpath,/home/koti/buildroot-desktop/buildroot/output/host/lib CMakeFiles/cmTC_7bb2e.dir/CheckIncludeFile.c.o -o cmTC_7bb2e -lm
gmake[3]: Leaving directory ‘/home/koti/buildroot-desktop/buildroot/output/build/host-llvm-15.0.0/buildroot-build/CMakeFiles/CMakeTmp’
gmake[2]: Leaving directory ‘/home/koti/buildroot-desktop/buildroot/output/build/host-llvm-15.0.0/buildroot-build/CMakeFiles/CMakeTmp’

Determining if the include file errno.h exists passed with the following output:
Change Dir: /home/koti/buildroot-desktop/buildroot/output/build/host-llvm-15.0.0/buildroot-build/CMakeFiles/CMakeTmp

Run Build Command(s):/usr/bin/gmake -f Makefile cmTC_3f35c/fast && gmake[2]: Entering directory ‘/home/koti/buildroot-desktop/buildroot/output/build/host-llvm-15.0.0/buildroot-build/CMakeFiles/CMakeTmp’
/usr/bin/gmake -f CMakeFiles/cmTC_3f35c.dir/build.make CMakeFiles/cmTC_3f35c.dir/build
gmake[3]: Entering directory ‘/home/koti/buildroot-desktop/buildroot/output/build/host-llvm-15.0.0/buildroot-build/CMakeFiles/CMakeTmp’
Building C object CMakeFiles/cmTC_3f35c.dir/CheckIncludeFile.c.o
/usr/bin/gcc -O2 -I/home/koti/buildroot-desktop/buildroot/output/host/include -o CMakeFiles/cmTC_3f35c.dir/CheckIncludeFile.c.o -c /home/koti/buildroot-desktop/buildroot/output/build/host-llvm-15.0.0/buildroot-build/CMakeFiles/CMakeTmp/CheckIncludeFile.c
Linking C executable cmTC_3f35c
/usr/bin/cmake -E cmake_link_script CMakeFiles/cmTC_3f35c.dir/link.txt --verbose=1
/usr/bin/gcc -O2 -I/home/koti/buildroot-desktop/buildroot/output/host/include -L/home/koti/buildroot-desktop/buildroot/output/host/lib -Wl,-rpath,/home/koti/buildroot-desktop/buildroot/output/host/lib CMakeFiles/cmTC_3f35c.dir/CheckIncludeFile.c.o -o cmTC_3f35c -lm
gmake[3]: Leaving directory ‘/home/koti/buildroot-desktop/buildroot/output/build/host-llvm-15.0.0/buildroot-build/CMakeFiles/CMakeTmp’
gmake[2]: Leaving directory ‘/home/koti/buildroot-desktop/buildroot/output/build/host-llvm-15.0.0/buildroot-build/CMakeFiles/CMakeTmp’

Determining if the include file fcntl.h exists passed with the following output:
Change Dir: /home/koti/buildroot-desktop/buildroot/output/build/host-llvm-15.0.0/buildroot-build/CMakeFiles/CMakeTmp

Run Build Command(s):/usr/bin/gmake -f Makefile cmTC_a22f4/fast && gmake[2]: Entering directory ‘/home/koti/buildroot-desktop/buildroot/output/build/host-llvm-15.0.0/buildroot-build/CMakeFiles/CMakeTmp’
/usr/bin/gmake -f CMakeFiles/cmTC_a22f4.dir/build.make CMakeFiles/cmTC_a22f4.dir/build
gmake[3]: Entering directory ‘/home/koti/buildroot-desktop/buildroot/output/build/host-llvm-15.0.0/buildroot-build/CMakeFiles/CMakeTmp’
Building C object CMakeFiles/cmTC_a22f4.dir/CheckIncludeFile.c.o
/usr/bin/gcc -O2 -I/home/koti/buildroot-desktop/buildroot/output/host/include -o CMakeFiles/cmTC_a22f4.dir/CheckIncludeFile.c.o -c /home/koti/buildroot-desktop/buildroot/output/build/host-llvm-15.0.0/buildroot-build/CMakeFiles/CMakeTmp/CheckIncludeFile.c
Linking C executable cmTC_a22f4
/usr/bin/cmake -E cmake_link_script CMakeFiles/cmTC_a22f4.dir/link.txt --verbose=1
/usr/bin/gcc -O2 -I/home/koti/buildroot-desktop/buildroot/output/host/include -L/home/koti/buildroot-desktop/buildroot/output/host/lib -Wl,-rpath,/home/koti/buildroot-desktop/buildroot/output/host/lib CMakeFiles/cmTC_a22f4.dir/CheckIncludeFile.c.o -o cmTC_a22f4 -lm
gmake[3]: Leaving directory ‘/home/koti/buildroot-desktop/buildroot/output/build/host-llvm-15.0.0/buildroot-build/CMakeFiles/CMakeTmp’
gmake[2]: Leaving directory ‘/home/koti/buildroot-desktop/buildroot/output/build/host-llvm-15.0.0/buildroot-build/CMakeFiles/CMakeTmp’

Determining if the include file link.h exists passed with the following output:
Change Dir: /home/koti/buildroot-desktop/buildroot/output/build/host-llvm-15.0.0/buildroot-build/CMakeFiles/CMakeTmp

Run Build Command(s):/usr/bin/gmake -f Makefile cmTC_af134/fast && gmake[2]: Entering directory ‘/home/koti/buildroot-desktop/buildroot/output/build/host-llvm-15.0.0/buildroot-build/CMakeFiles/CMakeTmp’
/usr/bin/gmake -f CMakeFiles/cmTC_af134.dir/build.make CMakeFiles/cmTC_af134.dir/build
gmake[3]: Entering directory ‘/home/koti/buildroot-desktop/buildroot/output/build/host-llvm-15.0.0/buildroot-build/CMakeFiles/CMakeTmp’
Building C object CMakeFiles/cmTC_af134.dir/CheckIncludeFile.c.o
/usr/bin/gcc -O2 -I/home/koti/buildroot-desktop/buildroot/output/host/include -o CMakeFiles/cmTC_af134.dir/CheckIncludeFile.c.o -c /home/koti/buildroot-desktop/buildroot/output/build/host-llvm-15.0.0/buildroot-build/CMakeFiles/CMakeTmp/CheckIncludeFile.c
Linking C executable cmTC_af134
/usr/bin/cmake -E cmake_link_script CMakeFiles/cmTC_af134.dir/link.txt --verbose=1
/usr/bin/gcc -O2 -I/home/koti/buildroot-desktop/buildroot/output/host/include -L/home/koti/buildroot-desktop/buildroot/output/host/lib -Wl,-rpath,/home/koti/buildroot-desktop/buildroot/output/host/lib CMakeFiles/cmTC_af134.dir/CheckIncludeFile.c.o -o cmTC_af134 -lm
gmake[3]: Leaving directory ‘/home/koti/buildroot-desktop/buildroot/output/build/host-llvm-15.0.0/buildroot-build/CMakeFiles/CMakeTmp’
gmake[2]: Leaving directory ‘/home/koti/buildroot-desktop/buildroot/output/build/host-llvm-15.0.0/buildroot-build/CMakeFiles/CMakeTmp’

Determining if the include file pthread.h exists passed with the following output:
Change Dir: /home/koti/buildroot-desktop/buildroot/output/build/host-llvm-15.0.0/buildroot-build/CMakeFiles/CMakeTmp

Run Build Command(s):/usr/bin/gmake -f Makefile cmTC_64ceb/fast && gmake[2]: Entering directory ‘/home/koti/buildroot-desktop/buildroot/output/build/host-llvm-15.0.0/buildroot-build/CMakeFiles/CMakeTmp’
/usr/bin/gmake -f CMakeFiles/cmTC_64ceb.dir/build.make CMakeFiles/cmTC_64ceb.dir/build
gmake[3]: Entering directory ‘/home/koti/buildroot-desktop/buildroot/output/build/host-llvm-15.0.0/buildroot-build/CMakeFiles/CMakeTmp’
Building C object CMakeFiles/cmTC_64ceb.dir/CheckIncludeFile.c.o
/usr/bin/gcc -O2 -I/home/koti/buildroot-desktop/buildroot/output/host/include -o CMakeFiles/cmTC_64ceb.dir/CheckIncludeFile.c.o -c /home/koti/buildroot-desktop/buildroot/output/build/host-llvm-15.0.0/buildroot-build/CMakeFiles/CMakeTmp/CheckIncludeFile.c
Linking C executable cmTC_64ceb
/usr/bin/cmake -E cmake_link_script CMakeFiles/cmTC_64ceb.dir/link.txt --verbose=1
/usr/bin/gcc -O2 -I/home/koti/buildroot-desktop/buildroot/output/host/include -L/home/koti/buildroot-desktop/buildroot/output/host/lib -Wl,-rpath,/home/koti/buildroot-desktop/buildroot/output/host/lib CMakeFiles/cmTC_64ceb.dir/CheckIncludeFile.c.o -o cmTC_64ceb -lm
gmake[3]: Leaving directory ‘/home/koti/buildroot-desktop/buildroot/output/build/host-llvm-15.0.0/buildroot-build/CMakeFiles/CMakeTmp’
gmake[2]: Leaving directory ‘/home/koti/buildroot-desktop/buildroot/output/build/host-llvm-15.0.0/buildroot-build/CMakeFiles/CMakeTmp’

Determining if the include file signal.h exists passed with the following output:
Change Dir: /home/koti/buildroot-desktop/buildroot/output/build/host-llvm-15.0.0/buildroot-build/CMakeFiles/CMakeTmp

Run Build Command(s):/usr/bin/gmake -f Makefile cmTC_413a3/fast && gmake[2]: Entering directory ‘/home/koti/buildroot-desktop/buildroot/output/build/host-llvm-15.0.0/buildroot-build/CMakeFiles/CMakeTmp’
/usr/bin/gmake -f CMakeFiles/cmTC_413a3.dir/build.make CMakeFiles/cmTC_413a3.dir/build
gmake[3]: Entering directory ‘/home/koti/buildroot-desktop/buildroot/output/build/host-llvm-15.0.0/buildroot-build/CMakeFiles/CMakeTmp’
Building C object CMakeFiles/cmTC_413a3.dir/CheckIncludeFile.c.o
/usr/bin/gcc -O2 -I/home/koti/buildroot-desktop/buildroot/output/host/include -o CMakeFiles/cmTC_413a3.dir/CheckIncludeFile.c.o -c /home/koti/buildroot-desktop/buildroot/output/build/host-llvm-15.0.0/buildroot-build/CMakeFiles/CMakeTmp/CheckIncludeFile.c
Linking C executable cmTC_413a3
/usr/bin/cmake -E cmake_link_script CMakeFiles/cmTC_413a3.dir/link.txt --verbose=1
/usr/bin/gcc -O2 -I/home/koti/buildroot-desktop/buildroot/output/host/include -L/home/koti/buildroot-desktop/buildroot/output/host/lib -Wl,-rpath,/home/koti/buildroot-desktop/buildroot/output/host/lib CMakeFiles/cmTC_413a3.dir/CheckIncludeFile.c.o -o cmTC_413a3 -lm
gmake[3]: Leaving directory ‘/home/koti/buildroot-desktop/buildroot/output/build/host-llvm-15.0.0/buildroot-build/CMakeFiles/CMakeTmp’
gmake[2]: Leaving directory ‘/home/koti/buildroot-desktop/buildroot/output/build/host-llvm-15.0.0/buildroot-build/CMakeFiles/CMakeTmp’

Determining if the include file sys/ioctl.h exists passed with the following output:
Change Dir: /home/koti/buildroot-desktop/buildroot/output/build/host-llvm-15.0.0/buildroot-build/CMakeFiles/CMakeTmp

Run Build Command(s):/usr/bin/gmake -f Makefile cmTC_ffcfc/fast && gmake[2]: Entering directory ‘/home/koti/buildroot-desktop/buildroot/output/build/host-llvm-15.0.0/buildroot-build/CMakeFiles/CMakeTmp’
/usr/bin/gmake -f CMakeFiles/cmTC_ffcfc.dir/build.make CMakeFiles/cmTC_ffcfc.dir/build
gmake[3]: Entering directory ‘/home/koti/buildroot-desktop/buildroot/output/build/host-llvm-15.0.0/buildroot-build/CMakeFiles/CMakeTmp’
Building C object CMakeFiles/cmTC_ffcfc.dir/CheckIncludeFile.c.o
/usr/bin/gcc -O2 -I/home/koti/buildroot-desktop/buildroot/output/host/include -o CMakeFiles/cmTC_ffcfc.dir/CheckIncludeFile.c.o -c /home/koti/buildroot-desktop/buildroot/output/build/host-llvm-15.0.0/buildroot-build/CMakeFiles/CMakeTmp/CheckIncludeFile.c
Linking C executable cmTC_ffcfc
/usr/bin/cmake -E cmake_link_script CMakeFiles/cmTC_ffcfc.dir/link.txt --verbose=1
/usr/bin/gcc -O2 -I/home/koti/buildroot-desktop/buildroot/output/host/include -L/home/koti/buildroot-desktop/buildroot/output/host/lib -Wl,-rpath,/home/koti/buildroot-desktop/buildroot/output/host/lib CMakeFiles/cmTC_ffcfc.dir/CheckIncludeFile.c.o -o cmTC_ffcfc -lm
gmake[3]: Leaving directory ‘/home/koti/buildroot-desktop/buildroot/output/build/host-llvm-15.0.0/buildroot-build/CMakeFiles/CMakeTmp’
gmake[2]: Leaving directory ‘/home/koti/buildroot-desktop/buildroot/output/build/host-llvm-15.0.0/buildroot-build/CMakeFiles/CMakeTmp’

Determining if the include file sys/mman.h exists passed with the following output:
Change Dir: /home/koti/buildroot-desktop/buildroot/output/build/host-llvm-15.0.0/buildroot-build/CMakeFiles/CMakeTmp

Run Build Command(s):/usr/bin/gmake -f Makefile cmTC_2ad64/fast && gmake[2]: Entering directory ‘/home/koti/buildroot-desktop/buildroot/output/build/host-llvm-15.0.0/buildroot-build/CMakeFiles/CMakeTmp’
/usr/bin/gmake -f CMakeFiles/cmTC_2ad64.dir/build.make CMakeFiles/cmTC_2ad64.dir/build
gmake[3]: Entering directory ‘/home/koti/buildroot-desktop/buildroot/output/build/host-llvm-15.0.0/buildroot-build/CMakeFiles/CMakeTmp’
Building C object CMakeFiles/cmTC_2ad64.dir/CheckIncludeFile.c.o
/usr/bin/gcc -O2 -I/home/koti/buildroot-desktop/buildroot/output/host/include -o CMakeFiles/cmTC_2ad64.dir/CheckIncludeFile.c.o -c /home/koti/buildroot-desktop/buildroot/output/build/host-llvm-15.0.0/buildroot-build/CMakeFiles/CMakeTmp/CheckIncludeFile.c
Linking C executable cmTC_2ad64
/usr/bin/cmake -E cmake_link_script CMakeFiles/cmTC_2ad64.dir/link.txt --verbose=1
/usr/bin/gcc -O2 -I/home/koti/buildroot-desktop/buildroot/output/host/include -L/home/koti/buildroot-desktop/buildroot/output/host/lib -Wl,-rpath,/home/koti/buildroot-desktop/buildroot/output/host/lib CMakeFiles/cmTC_2ad64.dir/CheckIncludeFile.c.o -o cmTC_2ad64 -lm
gmake[3]: Leaving directory ‘/home/koti/buildroot-desktop/buildroot/output/build/host-llvm-15.0.0/buildroot-build/CMakeFiles/CMakeTmp’
gmake[2]: Leaving directory ‘/home/koti/buildroot-desktop/buildroot/output/build/host-llvm-15.0.0/buildroot-build/CMakeFiles/CMakeTmp’

Determining if the include file sys/param.h exists passed with the following output:
Change Dir: /home/koti/buildroot-desktop/buildroot/output/build/host-llvm-15.0.0/buildroot-build/CMakeFiles/CMakeTmp

Run Build Command(s):/usr/bin/gmake -f Makefile cmTC_2080a/fast && gmake[2]: Entering directory ‘/home/koti/buildroot-desktop/buildroot/output/build/host-llvm-15.0.0/buildroot-build/CMakeFiles/CMakeTmp’
/usr/bin/gmake -f CMakeFiles/cmTC_2080a.dir/build.make CMakeFiles/cmTC_2080a.dir/build
gmake[3]: Entering directory ‘/home/koti/buildroot-desktop/buildroot/output/build/host-llvm-15.0.0/buildroot-build/CMakeFiles/CMakeTmp’
Building C object CMakeFiles/cmTC_2080a.dir/CheckIncludeFile.c.o
/usr/bin/gcc -O2 -I/home/koti/buildroot-desktop/buildroot/output/host/include -o CMakeFiles/cmTC_2080a.dir/CheckIncludeFile.c.o -c /home/koti/buildroot-desktop/buildroot/output/build/host-llvm-15.0.0/buildroot-build/CMakeFiles/CMakeTmp/CheckIncludeFile.c
Linking C executable cmTC_2080a
/usr/bin/cmake -E cmake_link_script CMakeFiles/cmTC_2080a.dir/link.txt --verbose=1
/usr/bin/gcc -O2 -I/home/koti/buildroot-desktop/buildroot/output/host/include -L/home/koti/buildroot-desktop/buildroot/output/host/lib -Wl,-rpath,/home/koti/buildroot-desktop/buildroot/output/host/lib CMakeFiles/cmTC_2080a.dir/CheckIncludeFile.c.o -o cmTC_2080a -lm
gmake[3]: Leaving directory ‘/home/koti/buildroot-desktop/buildroot/output/build/host-llvm-15.0.0/buildroot-build/CMakeFiles/CMakeTmp’
gmake[2]: Leaving directory ‘/home/koti/buildroot-desktop/buildroot/output/build/host-llvm-15.0.0/buildroot-build/CMakeFiles/CMakeTmp’

Determining if the include file sys/resource.h exists passed with the following output:
Change Dir: /home/koti/buildroot-desktop/buildroot/output/build/host-llvm-15.0.0/buildroot-build/CMakeFiles/CMakeTmp

Run Build Command(s):/usr/bin/gmake -f Makefile cmTC_67803/fast && gmake[2]: Entering directory ‘/home/koti/buildroot-desktop/buildroot/output/build/host-llvm-15.0.0/buildroot-build/CMakeFiles/CMakeTmp’
/usr/bin/gmake -f CMakeFiles/cmTC_67803.dir/build.make CMakeFiles/cmTC_67803.dir/build
gmake[3]: Entering directory ‘/home/koti/buildroot-desktop/buildroot/output/build/host-llvm-15.0.0/buildroot-build/CMakeFiles/CMakeTmp’
Building C object CMakeFiles/cmTC_67803.dir/CheckIncludeFile.c.o
/usr/bin/gcc -O2 -I/home/koti/buildroot-desktop/buildroot/output/host/include -o CMakeFiles/cmTC_67803.dir/CheckIncludeFile.c.o -c /home/koti/buildroot-desktop/buildroot/output/build/host-llvm-15.0.0/buildroot-build/CMakeFiles/CMakeTmp/CheckIncludeFile.c
Linking C executable cmTC_67803
/usr/bin/cmake -E cmake_link_script CMakeFiles/cmTC_67803.dir/link.txt --verbose=1
/usr/bin/gcc -O2 -I/home/koti/buildroot-desktop/buildroot/output/host/include -L/home/koti/buildroot-desktop/buildroot/output/host/lib -Wl,-rpath,/home/koti/buildroot-desktop/buildroot/output/host/lib CMakeFiles/cmTC_67803.dir/CheckIncludeFile.c.o -o cmTC_67803 -lm
gmake[3]: Leaving directory ‘/home/koti/buildroot-desktop/buildroot/output/build/host-llvm-15.0.0/buildroot-build/CMakeFiles/CMakeTmp’
gmake[2]: Leaving directory ‘/home/koti/buildroot-desktop/buildroot/output/build/host-llvm-15.0.0/buildroot-build/CMakeFiles/CMakeTmp’

Determining if the include file sys/stat.h exists passed with the following output:
Change Dir: /home/koti/buildroot-desktop/buildroot/output/build/host-llvm-15.0.0/buildroot-build/CMakeFiles/CMakeTmp

Run Build Command(s):/usr/bin/gmake -f Makefile cmTC_e5f8b/fast && gmake[2]: Entering directory ‘/home/koti/buildroot-desktop/buildroot/output/build/host-llvm-15.0.0/buildroot-build/CMakeFiles/CMakeTmp’
/usr/bin/gmake -f CMakeFiles/cmTC_e5f8b.dir/build.make CMakeFiles/cmTC_e5f8b.dir/build
gmake[3]: Entering directory ‘/home/koti/buildroot-desktop/buildroot/output/build/host-llvm-15.0.0/buildroot-build/CMakeFiles/CMakeTmp’
Building C object CMakeFiles/cmTC_e5f8b.dir/CheckIncludeFile.c.o
/usr/bin/gcc -O2 -I/home/koti/buildroot-desktop/buildroot/output/host/include -o CMakeFiles/cmTC_e5f8b.dir/CheckIncludeFile.c.o -c /home/koti/buildroot-desktop/buildroot/output/build/host-llvm-15.0.0/buildroot-build/CMakeFiles/CMakeTmp/CheckIncludeFile.c
Linking C executable cmTC_e5f8b
/usr/bin/cmake -E cmake_link_script CMakeFiles/cmTC_e5f8b.dir/link.txt --verbose=1
/usr/bin/gcc -O2 -I/home/koti/buildroot-desktop/buildroot/output/host/include -L/home/koti/buildroot-desktop/buildroot/output/host/lib -Wl,-rpath,/home/koti/buildroot-desktop/buildroot/output/host/lib CMakeFiles/cmTC_e5f8b.dir/CheckIncludeFile.c.o -o cmTC_e5f8b -lm
gmake[3]: Leaving directory ‘/home/koti/buildroot-desktop/buildroot/output/build/host-llvm-15.0.0/buildroot-build/CMakeFiles/CMakeTmp’
gmake[2]: Leaving directory ‘/home/koti/buildroot-desktop/buildroot/output/build/host-llvm-15.0.0/buildroot-build/CMakeFiles/CMakeTmp’

Determining if the include file sys/time.h exists passed with the following output:
Change Dir: /home/koti/buildroot-desktop/buildroot/output/build/host-llvm-15.0.0/buildroot-build/CMakeFiles/CMakeTmp

Run Build Command(s):/usr/bin/gmake -f Makefile cmTC_452e2/fast && gmake[2]: Entering directory ‘/home/koti/buildroot-desktop/buildroot/output/build/host-llvm-15.0.0/buildroot-build/CMakeFiles/CMakeTmp’
/usr/bin/gmake -f CMakeFiles/cmTC_452e2.dir/build.make CMakeFiles/cmTC_452e2.dir/build
gmake[3]: Entering directory ‘/home/koti/buildroot-desktop/buildroot/output/build/host-llvm-15.0.0/buildroot-build/CMakeFiles/CMakeTmp’
Building C object CMakeFiles/cmTC_452e2.dir/CheckIncludeFile.c.o
/usr/bin/gcc -O2 -I/home/koti/buildroot-desktop/buildroot/output/host/include -o CMakeFiles/cmTC_452e2.dir/CheckIncludeFile.c.o -c /home/koti/buildroot-desktop/buildroot/output/build/host-llvm-15.0.0/buildroot-build/CMakeFiles/CMakeTmp/CheckIncludeFile.c
Linking C executable cmTC_452e2
/usr/bin/cmake -E cmake_link_script CMakeFiles/cmTC_452e2.dir/link.txt --verbose=1
/usr/bin/gcc -O2 -I/home/koti/buildroot-desktop/buildroot/output/host/include -L/home/koti/buildroot-desktop/buildroot/output/host/lib -Wl,-rpath,/home/koti/buildroot-desktop/buildroot/output/host/lib CMakeFiles/cmTC_452e2.dir/CheckIncludeFile.c.o -o cmTC_452e2 -lm
gmake[3]: Leaving directory ‘/home/koti/buildroot-desktop/buildroot/output/build/host-llvm-15.0.0/buildroot-build/CMakeFiles/CMakeTmp’
gmake[2]: Leaving directory ‘/home/koti/buildroot-desktop/buildroot/output/build/host-llvm-15.0.0/buildroot-build/CMakeFiles/CMakeTmp’


}}

CMakeLog continuation:

{{
Determining if the include file sys/types.h exists passed with the following output:
Change Dir: /home/koti/buildroot-desktop/buildroot/output/build/host-llvm-15.0.0/buildroot-build/CMakeFiles/CMakeTmp

Run Build Command(s):/usr/bin/gmake -f Makefile cmTC_4050c/fast && gmake[2]: Entering directory ‘/home/koti/buildroot-desktop/buildroot/output/build/host-llvm-15.0.0/buildroot-build/CMakeFiles/CMakeTmp’
/usr/bin/gmake -f CMakeFiles/cmTC_4050c.dir/build.make CMakeFiles/cmTC_4050c.dir/build
gmake[3]: Entering directory ‘/home/koti/buildroot-desktop/buildroot/output/build/host-llvm-15.0.0/buildroot-build/CMakeFiles/CMakeTmp’
Building C object CMakeFiles/cmTC_4050c.dir/CheckIncludeFile.c.o
/usr/bin/gcc -O2 -I/home/koti/buildroot-desktop/buildroot/output/host/include -o CMakeFiles/cmTC_4050c.dir/CheckIncludeFile.c.o -c /home/koti/buildroot-desktop/buildroot/output/build/host-llvm-15.0.0/buildroot-build/CMakeFiles/CMakeTmp/CheckIncludeFile.c
Linking C executable cmTC_4050c
/usr/bin/cmake -E cmake_link_script CMakeFiles/cmTC_4050c.dir/link.txt --verbose=1
/usr/bin/gcc -O2 -I/home/koti/buildroot-desktop/buildroot/output/host/include -L/home/koti/buildroot-desktop/buildroot/output/host/lib -Wl,-rpath,/home/koti/buildroot-desktop/buildroot/output/host/lib CMakeFiles/cmTC_4050c.dir/CheckIncludeFile.c.o -o cmTC_4050c -lm
gmake[3]: Leaving directory ‘/home/koti/buildroot-desktop/buildroot/output/build/host-llvm-15.0.0/buildroot-build/CMakeFiles/CMakeTmp’
gmake[2]: Leaving directory ‘/home/koti/buildroot-desktop/buildroot/output/build/host-llvm-15.0.0/buildroot-build/CMakeFiles/CMakeTmp’

Determining if the include file sysexits.h exists passed with the following output:
Change Dir: /home/koti/buildroot-desktop/buildroot/output/build/host-llvm-15.0.0/buildroot-build/CMakeFiles/CMakeTmp

Run Build Command(s):/usr/bin/gmake -f Makefile cmTC_9d8f0/fast && gmake[2]: Entering directory ‘/home/koti/buildroot-desktop/buildroot/output/build/host-llvm-15.0.0/buildroot-build/CMakeFiles/CMakeTmp’
/usr/bin/gmake -f CMakeFiles/cmTC_9d8f0.dir/build.make CMakeFiles/cmTC_9d8f0.dir/build
gmake[3]: Entering directory ‘/home/koti/buildroot-desktop/buildroot/output/build/host-llvm-15.0.0/buildroot-build/CMakeFiles/CMakeTmp’
Building C object CMakeFiles/cmTC_9d8f0.dir/CheckIncludeFile.c.o
/usr/bin/gcc -O2 -I/home/koti/buildroot-desktop/buildroot/output/host/include -o CMakeFiles/cmTC_9d8f0.dir/CheckIncludeFile.c.o -c /home/koti/buildroot-desktop/buildroot/output/build/host-llvm-15.0.0/buildroot-build/CMakeFiles/CMakeTmp/CheckIncludeFile.c
Linking C executable cmTC_9d8f0
/usr/bin/cmake -E cmake_link_script CMakeFiles/cmTC_9d8f0.dir/link.txt --verbose=1
/usr/bin/gcc -O2 -I/home/koti/buildroot-desktop/buildroot/output/host/include -L/home/koti/buildroot-desktop/buildroot/output/host/lib -Wl,-rpath,/home/koti/buildroot-desktop/buildroot/output/host/lib CMakeFiles/cmTC_9d8f0.dir/CheckIncludeFile.c.o -o cmTC_9d8f0 -lm
gmake[3]: Leaving directory ‘/home/koti/buildroot-desktop/buildroot/output/build/host-llvm-15.0.0/buildroot-build/CMakeFiles/CMakeTmp’
gmake[2]: Leaving directory ‘/home/koti/buildroot-desktop/buildroot/output/build/host-llvm-15.0.0/buildroot-build/CMakeFiles/CMakeTmp’

Determining if the include file termios.h exists passed with the following output:
Change Dir: /home/koti/buildroot-desktop/buildroot/output/build/host-llvm-15.0.0/buildroot-build/CMakeFiles/CMakeTmp

Run Build Command(s):/usr/bin/gmake -f Makefile cmTC_d0e2e/fast && gmake[2]: Entering directory ‘/home/koti/buildroot-desktop/buildroot/output/build/host-llvm-15.0.0/buildroot-build/CMakeFiles/CMakeTmp’
/usr/bin/gmake -f CMakeFiles/cmTC_d0e2e.dir/build.make CMakeFiles/cmTC_d0e2e.dir/build
gmake[3]: Entering directory ‘/home/koti/buildroot-desktop/buildroot/output/build/host-llvm-15.0.0/buildroot-build/CMakeFiles/CMakeTmp’
Building C object CMakeFiles/cmTC_d0e2e.dir/CheckIncludeFile.c.o
/usr/bin/gcc -O2 -I/home/koti/buildroot-desktop/buildroot/output/host/include -o CMakeFiles/cmTC_d0e2e.dir/CheckIncludeFile.c.o -c /home/koti/buildroot-desktop/buildroot/output/build/host-llvm-15.0.0/buildroot-build/CMakeFiles/CMakeTmp/CheckIncludeFile.c
Linking C executable cmTC_d0e2e
/usr/bin/cmake -E cmake_link_script CMakeFiles/cmTC_d0e2e.dir/link.txt --verbose=1
/usr/bin/gcc -O2 -I/home/koti/buildroot-desktop/buildroot/output/host/include -L/home/koti/buildroot-desktop/buildroot/output/host/lib -Wl,-rpath,/home/koti/buildroot-desktop/buildroot/output/host/lib CMakeFiles/cmTC_d0e2e.dir/CheckIncludeFile.c.o -o cmTC_d0e2e -lm
gmake[3]: Leaving directory ‘/home/koti/buildroot-desktop/buildroot/output/build/host-llvm-15.0.0/buildroot-build/CMakeFiles/CMakeTmp’
gmake[2]: Leaving directory ‘/home/koti/buildroot-desktop/buildroot/output/build/host-llvm-15.0.0/buildroot-build/CMakeFiles/CMakeTmp’

Determining if the include file unistd.h exists passed with the following output:
Change Dir: /home/koti/buildroot-desktop/buildroot/output/build/host-llvm-15.0.0/buildroot-build/CMakeFiles/CMakeTmp

Run Build Command(s):/usr/bin/gmake -f Makefile cmTC_09a5d/fast && gmake[2]: Entering directory ‘/home/koti/buildroot-desktop/buildroot/output/build/host-llvm-15.0.0/buildroot-build/CMakeFiles/CMakeTmp’
/usr/bin/gmake -f CMakeFiles/cmTC_09a5d.dir/build.make CMakeFiles/cmTC_09a5d.dir/build
gmake[3]: Entering directory ‘/home/koti/buildroot-desktop/buildroot/output/build/host-llvm-15.0.0/buildroot-build/CMakeFiles/CMakeTmp’
Building C object CMakeFiles/cmTC_09a5d.dir/CheckIncludeFile.c.o
/usr/bin/gcc -O2 -I/home/koti/buildroot-desktop/buildroot/output/host/include -o CMakeFiles/cmTC_09a5d.dir/CheckIncludeFile.c.o -c /home/koti/buildroot-desktop/buildroot/output/build/host-llvm-15.0.0/buildroot-build/CMakeFiles/CMakeTmp/CheckIncludeFile.c
Linking C executable cmTC_09a5d
/usr/bin/cmake -E cmake_link_script CMakeFiles/cmTC_09a5d.dir/link.txt --verbose=1
/usr/bin/gcc -O2 -I/home/koti/buildroot-desktop/buildroot/output/host/include -L/home/koti/buildroot-desktop/buildroot/output/host/lib -Wl,-rpath,/home/koti/buildroot-desktop/buildroot/output/host/lib CMakeFiles/cmTC_09a5d.dir/CheckIncludeFile.c.o -o cmTC_09a5d -lm
gmake[3]: Leaving directory ‘/home/koti/buildroot-desktop/buildroot/output/build/host-llvm-15.0.0/buildroot-build/CMakeFiles/CMakeTmp’
gmake[2]: Leaving directory ‘/home/koti/buildroot-desktop/buildroot/output/build/host-llvm-15.0.0/buildroot-build/CMakeFiles/CMakeTmp’

Determining if the include file fenv.h exists passed with the following output:
Change Dir: /home/koti/buildroot-desktop/buildroot/output/build/host-llvm-15.0.0/buildroot-build/CMakeFiles/CMakeTmp

Run Build Command(s):/usr/bin/gmake -f Makefile cmTC_ca0e5/fast && gmake[2]: Entering directory ‘/home/koti/buildroot-desktop/buildroot/output/build/host-llvm-15.0.0/buildroot-build/CMakeFiles/CMakeTmp’
/usr/bin/gmake -f CMakeFiles/cmTC_ca0e5.dir/build.make CMakeFiles/cmTC_ca0e5.dir/build
gmake[3]: Entering directory ‘/home/koti/buildroot-desktop/buildroot/output/build/host-llvm-15.0.0/buildroot-build/CMakeFiles/CMakeTmp’
Building C object CMakeFiles/cmTC_ca0e5.dir/CheckIncludeFile.c.o
/usr/bin/gcc -O2 -I/home/koti/buildroot-desktop/buildroot/output/host/include -o CMakeFiles/cmTC_ca0e5.dir/CheckIncludeFile.c.o -c /home/koti/buildroot-desktop/buildroot/output/build/host-llvm-15.0.0/buildroot-build/CMakeFiles/CMakeTmp/CheckIncludeFile.c
Linking C executable cmTC_ca0e5
/usr/bin/cmake -E cmake_link_script CMakeFiles/cmTC_ca0e5.dir/link.txt --verbose=1
/usr/bin/gcc -O2 -I/home/koti/buildroot-desktop/buildroot/output/host/include -L/home/koti/buildroot-desktop/buildroot/output/host/lib -Wl,-rpath,/home/koti/buildroot-desktop/buildroot/output/host/lib CMakeFiles/cmTC_ca0e5.dir/CheckIncludeFile.c.o -o cmTC_ca0e5 -lm
gmake[3]: Leaving directory ‘/home/koti/buildroot-desktop/buildroot/output/build/host-llvm-15.0.0/buildroot-build/CMakeFiles/CMakeTmp’
gmake[2]: Leaving directory ‘/home/koti/buildroot-desktop/buildroot/output/build/host-llvm-15.0.0/buildroot-build/CMakeFiles/CMakeTmp’

Determining if the FE_ALL_EXCEPT exist passed with the following output:
Change Dir: /home/koti/buildroot-desktop/buildroot/output/build/host-llvm-15.0.0/buildroot-build/CMakeFiles/CMakeTmp

Run Build Command(s):/usr/bin/gmake -f Makefile cmTC_93328/fast && gmake[2]: Entering directory ‘/home/koti/buildroot-desktop/buildroot/output/build/host-llvm-15.0.0/buildroot-build/CMakeFiles/CMakeTmp’
/usr/bin/gmake -f CMakeFiles/cmTC_93328.dir/build.make CMakeFiles/cmTC_93328.dir/build
gmake[3]: Entering directory ‘/home/koti/buildroot-desktop/buildroot/output/build/host-llvm-15.0.0/buildroot-build/CMakeFiles/CMakeTmp’
Building C object CMakeFiles/cmTC_93328.dir/CheckSymbolExists.c.o
/usr/bin/gcc -O2 -I/home/koti/buildroot-desktop/buildroot/output/host/include -o CMakeFiles/cmTC_93328.dir/CheckSymbolExists.c.o -c /home/koti/buildroot-desktop/buildroot/output/build/host-llvm-15.0.0/buildroot-build/CMakeFiles/CMakeTmp/CheckSymbolExists.c
Linking C executable cmTC_93328
/usr/bin/cmake -E cmake_link_script CMakeFiles/cmTC_93328.dir/link.txt --verbose=1
/usr/bin/gcc -O2 -I/home/koti/buildroot-desktop/buildroot/output/host/include -L/home/koti/buildroot-desktop/buildroot/output/host/lib -Wl,-rpath,/home/koti/buildroot-desktop/buildroot/output/host/lib CMakeFiles/cmTC_93328.dir/CheckSymbolExists.c.o -o cmTC_93328 -lm
gmake[3]: Leaving directory ‘/home/koti/buildroot-desktop/buildroot/output/build/host-llvm-15.0.0/buildroot-build/CMakeFiles/CMakeTmp’
gmake[2]: Leaving directory ‘/home/koti/buildroot-desktop/buildroot/output/build/host-llvm-15.0.0/buildroot-build/CMakeFiles/CMakeTmp’

File /home/koti/buildroot-desktop/buildroot/output/build/host-llvm-15.0.0/buildroot-build/CMakeFiles/CMakeTmp/CheckSymbolExists.c:
/* */
#include <fenv.h>

int main(int argc, char** argv)
{
(void)argv;
#ifndef FE_ALL_EXCEPT
return ((int*)(&FE_ALL_EXCEPT))[argc];
#else
(void)argc;
return 0;
#endif
}
Determining if the FE_INEXACT exist passed with the following output:
Change Dir: /home/koti/buildroot-desktop/buildroot/output/build/host-llvm-15.0.0/buildroot-build/CMakeFiles/CMakeTmp

Run Build Command(s):/usr/bin/gmake -f Makefile cmTC_ab4c5/fast && gmake[2]: Entering directory ‘/home/koti/buildroot-desktop/buildroot/output/build/host-llvm-15.0.0/buildroot-build/CMakeFiles/CMakeTmp’
/usr/bin/gmake -f CMakeFiles/cmTC_ab4c5.dir/build.make CMakeFiles/cmTC_ab4c5.dir/build
gmake[3]: Entering directory ‘/home/koti/buildroot-desktop/buildroot/output/build/host-llvm-15.0.0/buildroot-build/CMakeFiles/CMakeTmp’
Building C object CMakeFiles/cmTC_ab4c5.dir/CheckSymbolExists.c.o
/usr/bin/gcc -O2 -I/home/koti/buildroot-desktop/buildroot/output/host/include -o CMakeFiles/cmTC_ab4c5.dir/CheckSymbolExists.c.o -c /home/koti/buildroot-desktop/buildroot/output/build/host-llvm-15.0.0/buildroot-build/CMakeFiles/CMakeTmp/CheckSymbolExists.c
Linking C executable cmTC_ab4c5
/usr/bin/cmake -E cmake_link_script CMakeFiles/cmTC_ab4c5.dir/link.txt --verbose=1
/usr/bin/gcc -O2 -I/home/koti/buildroot-desktop/buildroot/output/host/include -L/home/koti/buildroot-desktop/buildroot/output/host/lib -Wl,-rpath,/home/koti/buildroot-desktop/buildroot/output/host/lib CMakeFiles/cmTC_ab4c5.dir/CheckSymbolExists.c.o -o cmTC_ab4c5 -lm
gmake[3]: Leaving directory ‘/home/koti/buildroot-desktop/buildroot/output/build/host-llvm-15.0.0/buildroot-build/CMakeFiles/CMakeTmp’
gmake[2]: Leaving directory ‘/home/koti/buildroot-desktop/buildroot/output/build/host-llvm-15.0.0/buildroot-build/CMakeFiles/CMakeTmp’

File /home/koti/buildroot-desktop/buildroot/output/build/host-llvm-15.0.0/buildroot-build/CMakeFiles/CMakeTmp/CheckSymbolExists.c:
/* */
#include <fenv.h>

int main(int argc, char** argv)
{
(void)argv;
#ifndef FE_INEXACT
return ((int*)(&FE_INEXACT))[argc];
#else
(void)argc;
return 0;
#endif
}
Determining if the include file linux/magic.h exists passed with the following output:
Change Dir: /home/koti/buildroot-desktop/buildroot/output/build/host-llvm-15.0.0/buildroot-build/CMakeFiles/CMakeTmp

Run Build Command(s):/usr/bin/gmake -f Makefile cmTC_8e8ac/fast && gmake[2]: Entering directory ‘/home/koti/buildroot-desktop/buildroot/output/build/host-llvm-15.0.0/buildroot-build/CMakeFiles/CMakeTmp’
/usr/bin/gmake -f CMakeFiles/cmTC_8e8ac.dir/build.make CMakeFiles/cmTC_8e8ac.dir/build
gmake[3]: Entering directory ‘/home/koti/buildroot-desktop/buildroot/output/build/host-llvm-15.0.0/buildroot-build/CMakeFiles/CMakeTmp’
Building C object CMakeFiles/cmTC_8e8ac.dir/CheckIncludeFile.c.o
/usr/bin/gcc -O2 -I/home/koti/buildroot-desktop/buildroot/output/host/include -o CMakeFiles/cmTC_8e8ac.dir/CheckIncludeFile.c.o -c /home/koti/buildroot-desktop/buildroot/output/build/host-llvm-15.0.0/buildroot-build/CMakeFiles/CMakeTmp/CheckIncludeFile.c
Linking C executable cmTC_8e8ac
/usr/bin/cmake -E cmake_link_script CMakeFiles/cmTC_8e8ac.dir/link.txt --verbose=1
/usr/bin/gcc -O2 -I/home/koti/buildroot-desktop/buildroot/output/host/include -L/home/koti/buildroot-desktop/buildroot/output/host/lib -Wl,-rpath,/home/koti/buildroot-desktop/buildroot/output/host/lib CMakeFiles/cmTC_8e8ac.dir/CheckIncludeFile.c.o -o cmTC_8e8ac -lm
gmake[3]: Leaving directory ‘/home/koti/buildroot-desktop/buildroot/output/build/host-llvm-15.0.0/buildroot-build/CMakeFiles/CMakeTmp’
gmake[2]: Leaving directory ‘/home/koti/buildroot-desktop/buildroot/output/build/host-llvm-15.0.0/buildroot-build/CMakeFiles/CMakeTmp’

Determining if the function pthread_create exists in the pthread passed with the following output:
Change Dir: /home/koti/buildroot-desktop/buildroot/output/build/host-llvm-15.0.0/buildroot-build/CMakeFiles/CMakeTmp

Run Build Command(s):/usr/bin/gmake -f Makefile cmTC_431ae/fast && gmake[2]: Entering directory ‘/home/koti/buildroot-desktop/buildroot/output/build/host-llvm-15.0.0/buildroot-build/CMakeFiles/CMakeTmp’
/usr/bin/gmake -f CMakeFiles/cmTC_431ae.dir/build.make CMakeFiles/cmTC_431ae.dir/build
gmake[3]: Entering directory ‘/home/koti/buildroot-desktop/buildroot/output/build/host-llvm-15.0.0/buildroot-build/CMakeFiles/CMakeTmp’
Building C object CMakeFiles/cmTC_431ae.dir/CheckFunctionExists.c.o
/usr/bin/gcc -O2 -I/home/koti/buildroot-desktop/buildroot/output/host/include -DCHECK_FUNCTION_EXISTS=pthread_create -o CMakeFiles/cmTC_431ae.dir/CheckFunctionExists.c.o -c /usr/share/cmake-3.22/Modules/CheckFunctionExists.c
Linking C executable cmTC_431ae
/usr/bin/cmake -E cmake_link_script CMakeFiles/cmTC_431ae.dir/link.txt --verbose=1
/usr/bin/gcc -O2 -I/home/koti/buildroot-desktop/buildroot/output/host/include -DCHECK_FUNCTION_EXISTS=pthread_create -L/home/koti/buildroot-desktop/buildroot/output/host/lib -Wl,-rpath,/home/koti/buildroot-desktop/buildroot/output/host/lib CMakeFiles/cmTC_431ae.dir/CheckFunctionExists.c.o -o cmTC_431ae -lpthread -lm
gmake[3]: Leaving directory ‘/home/koti/buildroot-desktop/buildroot/output/build/host-llvm-15.0.0/buildroot-build/CMakeFiles/CMakeTmp’
gmake[2]: Leaving directory ‘/home/koti/buildroot-desktop/buildroot/output/build/host-llvm-15.0.0/buildroot-build/CMakeFiles/CMakeTmp’

Determining if the function pthread_rwlock_init exists in the pthread passed with the following output:
Change Dir: /home/koti/buildroot-desktop/buildroot/output/build/host-llvm-15.0.0/buildroot-build/CMakeFiles/CMakeTmp

Run Build Command(s):/usr/bin/gmake -f Makefile cmTC_79e7b/fast && gmake[2]: Entering directory ‘/home/koti/buildroot-desktop/buildroot/output/build/host-llvm-15.0.0/buildroot-build/CMakeFiles/CMakeTmp’
/usr/bin/gmake -f CMakeFiles/cmTC_79e7b.dir/build.make CMakeFiles/cmTC_79e7b.dir/build
gmake[3]: Entering directory ‘/home/koti/buildroot-desktop/buildroot/output/build/host-llvm-15.0.0/buildroot-build/CMakeFiles/CMakeTmp’
Building C object CMakeFiles/cmTC_79e7b.dir/CheckFunctionExists.c.o
/usr/bin/gcc -O2 -I/home/koti/buildroot-desktop/buildroot/output/host/include -DCHECK_FUNCTION_EXISTS=pthread_rwlock_init -o CMakeFiles/cmTC_79e7b.dir/CheckFunctionExists.c.o -c /usr/share/cmake-3.22/Modules/CheckFunctionExists.c
Linking C executable cmTC_79e7b
/usr/bin/cmake -E cmake_link_script CMakeFiles/cmTC_79e7b.dir/link.txt --verbose=1
/usr/bin/gcc -O2 -I/home/koti/buildroot-desktop/buildroot/output/host/include -DCHECK_FUNCTION_EXISTS=pthread_rwlock_init -L/home/koti/buildroot-desktop/buildroot/output/host/lib -Wl,-rpath,/home/koti/buildroot-desktop/buildroot/output/host/lib CMakeFiles/cmTC_79e7b.dir/CheckFunctionExists.c.o -o cmTC_79e7b -lpthread -lm
gmake[3]: Leaving directory ‘/home/koti/buildroot-desktop/buildroot/output/build/host-llvm-15.0.0/buildroot-build/CMakeFiles/CMakeTmp’
gmake[2]: Leaving directory ‘/home/koti/buildroot-desktop/buildroot/output/build/host-llvm-15.0.0/buildroot-build/CMakeFiles/CMakeTmp’

Determining if the function pthread_mutex_lock exists in the pthread passed with the following output:
Change Dir: /home/koti/buildroot-desktop/buildroot/output/build/host-llvm-15.0.0/buildroot-build/CMakeFiles/CMakeTmp

Run Build Command(s):/usr/bin/gmake -f Makefile cmTC_bfb7a/fast && gmake[2]: Entering directory ‘/home/koti/buildroot-desktop/buildroot/output/build/host-llvm-15.0.0/buildroot-build/CMakeFiles/CMakeTmp’
/usr/bin/gmake -f CMakeFiles/cmTC_bfb7a.dir/build.make CMakeFiles/cmTC_bfb7a.dir/build
gmake[3]: Entering directory ‘/home/koti/buildroot-desktop/buildroot/output/build/host-llvm-15.0.0/buildroot-build/CMakeFiles/CMakeTmp’
Building C object CMakeFiles/cmTC_bfb7a.dir/CheckFunctionExists.c.o
/usr/bin/gcc -O2 -I/home/koti/buildroot-desktop/buildroot/output/host/include -DCHECK_FUNCTION_EXISTS=pthread_mutex_lock -o CMakeFiles/cmTC_bfb7a.dir/CheckFunctionExists.c.o -c /usr/share/cmake-3.22/Modules/CheckFunctionExists.c
Linking C executable cmTC_bfb7a
/usr/bin/cmake -E cmake_link_script CMakeFiles/cmTC_bfb7a.dir/link.txt --verbose=1
/usr/bin/gcc -O2 -I/home/koti/buildroot-desktop/buildroot/output/host/include -DCHECK_FUNCTION_EXISTS=pthread_mutex_lock -L/home/koti/buildroot-desktop/buildroot/output/host/lib -Wl,-rpath,/home/koti/buildroot-desktop/buildroot/output/host/lib CMakeFiles/cmTC_bfb7a.dir/CheckFunctionExists.c.o -o cmTC_bfb7a -lpthread -lm
gmake[3]: Leaving directory ‘/home/koti/buildroot-desktop/buildroot/output/build/host-llvm-15.0.0/buildroot-build/CMakeFiles/CMakeTmp’
gmake[2]: Leaving directory ‘/home/koti/buildroot-desktop/buildroot/output/build/host-llvm-15.0.0/buildroot-build/CMakeFiles/CMakeTmp’

Determining if the function dlopen exists in the dl passed with the following output:
Change Dir: /home/koti/buildroot-desktop/buildroot/output/build/host-llvm-15.0.0/buildroot-build/CMakeFiles/CMakeTmp

Run Build Command(s):/usr/bin/gmake -f Makefile cmTC_d4401/fast && gmake[2]: Entering directory ‘/home/koti/buildroot-desktop/buildroot/output/build/host-llvm-15.0.0/buildroot-build/CMakeFiles/CMakeTmp’
/usr/bin/gmake -f CMakeFiles/cmTC_d4401.dir/build.make CMakeFiles/cmTC_d4401.dir/build
gmake[3]: Entering directory ‘/home/koti/buildroot-desktop/buildroot/output/build/host-llvm-15.0.0/buildroot-build/CMakeFiles/CMakeTmp’
Building C object CMakeFiles/cmTC_d4401.dir/CheckFunctionExists.c.o
/usr/bin/gcc -O2 -I/home/koti/buildroot-desktop/buildroot/output/host/include -DCHECK_FUNCTION_EXISTS=dlopen -o CMakeFiles/cmTC_d4401.dir/CheckFunctionExists.c.o -c /usr/share/cmake-3.22/Modules/CheckFunctionExists.c
Linking C executable cmTC_d4401
/usr/bin/cmake -E cmake_link_script CMakeFiles/cmTC_d4401.dir/link.txt --verbose=1
/usr/bin/gcc -O2 -I/home/koti/buildroot-desktop/buildroot/output/host/include -DCHECK_FUNCTION_EXISTS=dlopen -L/home/koti/buildroot-desktop/buildroot/output/host/lib -Wl,-rpath,/home/koti/buildroot-desktop/buildroot/output/host/lib CMakeFiles/cmTC_d4401.dir/CheckFunctionExists.c.o -o cmTC_d4401 -ldl -lm
gmake[3]: Leaving directory ‘/home/koti/buildroot-desktop/buildroot/output/build/host-llvm-15.0.0/buildroot-build/CMakeFiles/CMakeTmp’
gmake[2]: Leaving directory ‘/home/koti/buildroot-desktop/buildroot/output/build/host-llvm-15.0.0/buildroot-build/CMakeFiles/CMakeTmp’

Determining if the function clock_gettime exists in the rt passed with the following output:
Change Dir: /home/koti/buildroot-desktop/buildroot/output/build/host-llvm-15.0.0/buildroot-build/CMakeFiles/CMakeTmp

Run Build Command(s):/usr/bin/gmake -f Makefile cmTC_47a50/fast && gmake[2]: Entering directory ‘/home/koti/buildroot-desktop/buildroot/output/build/host-llvm-15.0.0/buildroot-build/CMakeFiles/CMakeTmp’
/usr/bin/gmake -f CMakeFiles/cmTC_47a50.dir/build.make CMakeFiles/cmTC_47a50.dir/build
gmake[3]: Entering directory ‘/home/koti/buildroot-desktop/buildroot/output/build/host-llvm-15.0.0/buildroot-build/CMakeFiles/CMakeTmp’
Building C object CMakeFiles/cmTC_47a50.dir/CheckFunctionExists.c.o
/usr/bin/gcc -O2 -I/home/koti/buildroot-desktop/buildroot/output/host/include -DCHECK_FUNCTION_EXISTS=clock_gettime -o CMakeFiles/cmTC_47a50.dir/CheckFunctionExists.c.o -c /usr/share/cmake-3.22/Modules/CheckFunctionExists.c
Linking C executable cmTC_47a50
/usr/bin/cmake -E cmake_link_script CMakeFiles/cmTC_47a50.dir/link.txt --verbose=1
/usr/bin/gcc -O2 -I/home/koti/buildroot-desktop/buildroot/output/host/include -DCHECK_FUNCTION_EXISTS=clock_gettime -L/home/koti/buildroot-desktop/buildroot/output/host/lib -Wl,-rpath,/home/koti/buildroot-desktop/buildroot/output/host/lib CMakeFiles/cmTC_47a50.dir/CheckFunctionExists.c.o -o cmTC_47a50 -lrt -lm
gmake[3]: Leaving directory ‘/home/koti/buildroot-desktop/buildroot/output/build/host-llvm-15.0.0/buildroot-build/CMakeFiles/CMakeTmp’
gmake[2]: Leaving directory ‘/home/koti/buildroot-desktop/buildroot/output/build/host-llvm-15.0.0/buildroot-build/CMakeFiles/CMakeTmp’

Determining if the include file pthread.h exists passed with the following output:
Change Dir: /home/koti/buildroot-desktop/buildroot/output/build/host-llvm-15.0.0/buildroot-build/CMakeFiles/CMakeTmp

Run Build Command(s):/usr/bin/gmake -f Makefile cmTC_f7b21/fast && gmake[2]: Entering directory ‘/home/koti/buildroot-desktop/buildroot/output/build/host-llvm-15.0.0/buildroot-build/CMakeFiles/CMakeTmp’
/usr/bin/gmake -f CMakeFiles/cmTC_f7b21.dir/build.make CMakeFiles/cmTC_f7b21.dir/build
gmake[3]: Entering directory ‘/home/koti/buildroot-desktop/buildroot/output/build/host-llvm-15.0.0/buildroot-build/CMakeFiles/CMakeTmp’
Building C object CMakeFiles/cmTC_f7b21.dir/CheckIncludeFile.c.o
/usr/bin/gcc -O2 -I/home/koti/buildroot-desktop/buildroot/output/host/include -o CMakeFiles/cmTC_f7b21.dir/CheckIncludeFile.c.o -c /home/koti/buildroot-desktop/buildroot/output/build/host-llvm-15.0.0/buildroot-build/CMakeFiles/CMakeTmp/CheckIncludeFile.c
Linking C executable cmTC_f7b21
/usr/bin/cmake -E cmake_link_script CMakeFiles/cmTC_f7b21.dir/link.txt --verbose=1
/usr/bin/gcc -O2 -I/home/koti/buildroot-desktop/buildroot/output/host/include -L/home/koti/buildroot-desktop/buildroot/output/host/lib -Wl,-rpath,/home/koti/buildroot-desktop/buildroot/output/host/lib CMakeFiles/cmTC_f7b21.dir/CheckIncludeFile.c.o -o cmTC_f7b21 -lm
gmake[3]: Leaving directory ‘/home/koti/buildroot-desktop/buildroot/output/build/host-llvm-15.0.0/buildroot-build/CMakeFiles/CMakeTmp’
gmake[2]: Leaving directory ‘/home/koti/buildroot-desktop/buildroot/output/build/host-llvm-15.0.0/buildroot-build/CMakeFiles/CMakeTmp’

Performing C SOURCE FILE Test CMAKE_HAVE_LIBC_PTHREAD succeeded with the following output:
Change Dir: /home/koti/buildroot-desktop/buildroot/output/build/host-llvm-15.0.0/buildroot-build/CMakeFiles/CMakeTmp

Run Build Command(s):/usr/bin/gmake -f Makefile cmTC_f0c5a/fast && gmake[2]: Entering directory ‘/home/koti/buildroot-desktop/buildroot/output/build/host-llvm-15.0.0/buildroot-build/CMakeFiles/CMakeTmp’
/usr/bin/gmake -f CMakeFiles/cmTC_f0c5a.dir/build.make CMakeFiles/cmTC_f0c5a.dir/build
gmake[3]: Entering directory ‘/home/koti/buildroot-desktop/buildroot/output/build/host-llvm-15.0.0/buildroot-build/CMakeFiles/CMakeTmp’
Building C object CMakeFiles/cmTC_f0c5a.dir/src.c.o
/usr/bin/gcc -DCMAKE_HAVE_LIBC_PTHREAD -O2 -I/home/koti/buildroot-desktop/buildroot/output/host/include -o CMakeFiles/cmTC_f0c5a.dir/src.c.o -c /home/koti/buildroot-desktop/buildroot/output/build/host-llvm-15.0.0/buildroot-build/CMakeFiles/CMakeTmp/src.c
Linking C executable cmTC_f0c5a
/usr/bin/cmake -E cmake_link_script CMakeFiles/cmTC_f0c5a.dir/link.txt --verbose=1
/usr/bin/gcc -O2 -I/home/koti/buildroot-desktop/buildroot/output/host/include -L/home/koti/buildroot-desktop/buildroot/output/host/lib -Wl,-rpath,/home/koti/buildroot-desktop/buildroot/output/host/lib CMakeFiles/cmTC_f0c5a.dir/src.c.o -o cmTC_f0c5a -lm
gmake[3]: Leaving directory ‘/home/koti/buildroot-desktop/buildroot/output/build/host-llvm-15.0.0/buildroot-build/CMakeFiles/CMakeTmp’
gmake[2]: Leaving directory ‘/home/koti/buildroot-desktop/buildroot/output/build/host-llvm-15.0.0/buildroot-build/CMakeFiles/CMakeTmp’

Source file was:
#include <pthread.h>

static void* test_func(void* data)
{
return data;
}

int main(void)
{
pthread_t thread;
pthread_create(&thread, NULL, test_func, NULL);
pthread_detach(thread);
pthread_cancel(thread);
pthread_join(thread, NULL);
pthread_atfork(NULL, NULL, NULL);
pthread_exit(NULL);

return 0;
}

Determining if the compress2 exist passed with the following output:
Change Dir: /home/koti/buildroot-desktop/buildroot/output/build/host-llvm-15.0.0/buildroot-build/CMakeFiles/CMakeTmp

Run Build Command(s):/usr/bin/gmake -f Makefile cmTC_4763e/fast && gmake[2]: Entering directory ‘/home/koti/buildroot-desktop/buildroot/output/build/host-llvm-15.0.0/buildroot-build/CMakeFiles/CMakeTmp’
/usr/bin/gmake -f CMakeFiles/cmTC_4763e.dir/build.make CMakeFiles/cmTC_4763e.dir/build
gmake[3]: Entering directory ‘/home/koti/buildroot-desktop/buildroot/output/build/host-llvm-15.0.0/buildroot-build/CMakeFiles/CMakeTmp’
Building C object CMakeFiles/cmTC_4763e.dir/CheckSymbolExists.c.o
/usr/bin/gcc -O2 -I/home/koti/buildroot-desktop/buildroot/output/host/include -o CMakeFiles/cmTC_4763e.dir/CheckSymbolExists.c.o -c /home/koti/buildroot-desktop/buildroot/output/build/host-llvm-15.0.0/buildroot-build/CMakeFiles/CMakeTmp/CheckSymbolExists.c
Linking C executable cmTC_4763e
/usr/bin/cmake -E cmake_link_script CMakeFiles/cmTC_4763e.dir/link.txt --verbose=1
/usr/bin/gcc -O2 -I/home/koti/buildroot-desktop/buildroot/output/host/include -L/home/koti/buildroot-desktop/buildroot/output/host/lib -Wl,-rpath,/home/koti/buildroot-desktop/buildroot/output/host/lib CMakeFiles/cmTC_4763e.dir/CheckSymbolExists.c.o -o cmTC_4763e -lm /home/koti/buildroot-desktop/buildroot/output/host/usr/lib/libz.so
gmake[3]: Leaving directory ‘/home/koti/buildroot-desktop/buildroot/output/build/host-llvm-15.0.0/buildroot-build/CMakeFiles/CMakeTmp’
gmake[2]: Leaving directory ‘/home/koti/buildroot-desktop/buildroot/output/build/host-llvm-15.0.0/buildroot-build/CMakeFiles/CMakeTmp’

File /home/koti/buildroot-desktop/buildroot/output/build/host-llvm-15.0.0/buildroot-build/CMakeFiles/CMakeTmp/CheckSymbolExists.c:
/* */
#include <zlib.h>

int main(int argc, char** argv)
{
(void)argv;
#ifndef compress2
return ((int*)(&compress2))[argc];
#else
(void)argc;
return 0;
#endif
}
Determining if the backtrace exist passed with the following output:
Change Dir: /home/koti/buildroot-desktop/buildroot/output/build/host-llvm-15.0.0/buildroot-build/CMakeFiles/CMakeTmp

Run Build Command(s):/usr/bin/gmake -f Makefile cmTC_505e1/fast && gmake[2]: Entering directory ‘/home/koti/buildroot-desktop/buildroot/output/build/host-llvm-15.0.0/buildroot-build/CMakeFiles/CMakeTmp’
/usr/bin/gmake -f CMakeFiles/cmTC_505e1.dir/build.make CMakeFiles/cmTC_505e1.dir/build
gmake[3]: Entering directory ‘/home/koti/buildroot-desktop/buildroot/output/build/host-llvm-15.0.0/buildroot-build/CMakeFiles/CMakeTmp’
Building C object CMakeFiles/cmTC_505e1.dir/CheckSymbolExists.c.o
/usr/bin/gcc -O2 -I/home/koti/buildroot-desktop/buildroot/output/host/include -o CMakeFiles/cmTC_505e1.dir/CheckSymbolExists.c.o -c /home/koti/buildroot-desktop/buildroot/output/build/host-llvm-15.0.0/buildroot-build/CMakeFiles/CMakeTmp/CheckSymbolExists.c
Linking C executable cmTC_505e1
/usr/bin/cmake -E cmake_link_script CMakeFiles/cmTC_505e1.dir/link.txt --verbose=1
/usr/bin/gcc -O2 -I/home/koti/buildroot-desktop/buildroot/output/host/include -L/home/koti/buildroot-desktop/buildroot/output/host/lib -Wl,-rpath,/home/koti/buildroot-desktop/buildroot/output/host/lib CMakeFiles/cmTC_505e1.dir/CheckSymbolExists.c.o -o cmTC_505e1
gmake[3]: Leaving directory ‘/home/koti/buildroot-desktop/buildroot/output/build/host-llvm-15.0.0/buildroot-build/CMakeFiles/CMakeTmp’
gmake[2]: Leaving directory ‘/home/koti/buildroot-desktop/buildroot/output/build/host-llvm-15.0.0/buildroot-build/CMakeFiles/CMakeTmp’

File /home/koti/buildroot-desktop/buildroot/output/build/host-llvm-15.0.0/buildroot-build/CMakeFiles/CMakeTmp/CheckSymbolExists.c:
/* */
#include <execinfo.h>

int main(int argc, char** argv)
{
(void)argv;
#ifndef backtrace
return ((int*)(&backtrace))[argc];
#else
(void)argc;
return 0;
#endif
}
Determining if the __register_frame exist passed with the following output:
Change Dir: /home/koti/buildroot-desktop/buildroot/output/build/host-llvm-15.0.0/buildroot-build/CMakeFiles/CMakeTmp

Run Build Command(s):/usr/bin/gmake -f Makefile cmTC_365a7/fast && gmake[2]: Entering directory ‘/home/koti/buildroot-desktop/buildroot/output/build/host-llvm-15.0.0/buildroot-build/CMakeFiles/CMakeTmp’
/usr/bin/gmake -f CMakeFiles/cmTC_365a7.dir/build.make CMakeFiles/cmTC_365a7.dir/build
gmake[3]: Entering directory ‘/home/koti/buildroot-desktop/buildroot/output/build/host-llvm-15.0.0/buildroot-build/CMakeFiles/CMakeTmp’
Building C object CMakeFiles/cmTC_365a7.dir/CheckSymbolExists.c.o
/usr/bin/gcc -O2 -I/home/koti/buildroot-desktop/buildroot/output/host/include -o CMakeFiles/cmTC_365a7.dir/CheckSymbolExists.c.o -c /home/koti/buildroot-desktop/buildroot/output/build/host-llvm-15.0.0/buildroot-build/CMakeFiles/CMakeTmp/CheckSymbolExists.c
Linking C executable cmTC_365a7
/usr/bin/cmake -E cmake_link_script CMakeFiles/cmTC_365a7.dir/link.txt --verbose=1
/usr/bin/gcc -O2 -I/home/koti/buildroot-desktop/buildroot/output/host/include -L/home/koti/buildroot-desktop/buildroot/output/host/lib -Wl,-rpath,/home/koti/buildroot-desktop/buildroot/output/host/lib CMakeFiles/cmTC_365a7.dir/CheckSymbolExists.c.o -o cmTC_365a7 -lm
gmake[3]: Leaving directory ‘/home/koti/buildroot-desktop/buildroot/output/build/host-llvm-15.0.0/buildroot-build/CMakeFiles/CMakeTmp’
gmake[2]: Leaving directory ‘/home/koti/buildroot-desktop/buildroot/output/build/host-llvm-15.0.0/buildroot-build/CMakeFiles/CMakeTmp’

File /home/koti/buildroot-desktop/buildroot/output/build/host-llvm-15.0.0/buildroot-build/CMakeFiles/CMakeTmp/CheckSymbolExists.c:
/* */
#include </home/koti/buildroot-desktop/buildroot/output/build/host-llvm-15.0.0/cmake/unwind.h>

int main(int argc, char** argv)
{
(void)argv;
#ifndef __register_frame
return ((int*)(&__register_frame))[argc];
#else
(void)argc;
return 0;
#endif
}
Determining if the __deregister_frame exist passed with the following output:
Change Dir: /home/koti/buildroot-desktop/buildroot/output/build/host-llvm-15.0.0/buildroot-build/CMakeFiles/CMakeTmp

Run Build Command(s):/usr/bin/gmake -f Makefile cmTC_b87cf/fast && gmake[2]: Entering directory ‘/home/koti/buildroot-desktop/buildroot/output/build/host-llvm-15.0.0/buildroot-build/CMakeFiles/CMakeTmp’
/usr/bin/gmake -f CMakeFiles/cmTC_b87cf.dir/build.make CMakeFiles/cmTC_b87cf.dir/build
gmake[3]: Entering directory ‘/home/koti/buildroot-desktop/buildroot/output/build/host-llvm-15.0.0/buildroot-build/CMakeFiles/CMakeTmp’
Building C object CMakeFiles/cmTC_b87cf.dir/CheckSymbolExists.c.o
/usr/bin/gcc -O2 -I/home/koti/buildroot-desktop/buildroot/output/host/include -o CMakeFiles/cmTC_b87cf.dir/CheckSymbolExists.c.o -c /home/koti/buildroot-desktop/buildroot/output/build/host-llvm-15.0.0/buildroot-build/CMakeFiles/CMakeTmp/CheckSymbolExists.c
Linking C executable cmTC_b87cf
/usr/bin/cmake -E cmake_link_script CMakeFiles/cmTC_b87cf.dir/link.txt --verbose=1
/usr/bin/gcc -O2 -I/home/koti/buildroot-desktop/buildroot/output/host/include -L/home/koti/buildroot-desktop/buildroot/output/host/lib -Wl,-rpath,/home/koti/buildroot-desktop/buildroot/output/host/lib CMakeFiles/cmTC_b87cf.dir/CheckSymbolExists.c.o -o cmTC_b87cf -lm
gmake[3]: Leaving directory ‘/home/koti/buildroot-desktop/buildroot/output/build/host-llvm-15.0.0/buildroot-build/CMakeFiles/CMakeTmp’
gmake[2]: Leaving directory ‘/home/koti/buildroot-desktop/buildroot/output/build/host-llvm-15.0.0/buildroot-build/CMakeFiles/CMakeTmp’

File /home/koti/buildroot-desktop/buildroot/output/build/host-llvm-15.0.0/buildroot-build/CMakeFiles/CMakeTmp/CheckSymbolExists.c:
/* */
#include </home/koti/buildroot-desktop/buildroot/output/build/host-llvm-15.0.0/cmake/unwind.h>

int main(int argc, char** argv)
{
(void)argv;
#ifndef __deregister_frame
return ((int*)(&__deregister_frame))[argc];
#else
(void)argc;
return 0;
#endif
}
Determining if the _Unwind_Backtrace exist passed with the following output:
Change Dir: /home/koti/buildroot-desktop/buildroot/output/build/host-llvm-15.0.0/buildroot-build/CMakeFiles/CMakeTmp

Run Build Command(s):/usr/bin/gmake -f Makefile cmTC_33489/fast && gmake[2]: Entering directory ‘/home/koti/buildroot-desktop/buildroot/output/build/host-llvm-15.0.0/buildroot-build/CMakeFiles/CMakeTmp’
/usr/bin/gmake -f CMakeFiles/cmTC_33489.dir/build.make CMakeFiles/cmTC_33489.dir/build
gmake[3]: Entering directory ‘/home/koti/buildroot-desktop/buildroot/output/build/host-llvm-15.0.0/buildroot-build/CMakeFiles/CMakeTmp’
Building C object CMakeFiles/cmTC_33489.dir/CheckSymbolExists.c.o
/usr/bin/gcc -O2 -I/home/koti/buildroot-desktop/buildroot/output/host/include -o CMakeFiles/cmTC_33489.dir/CheckSymbolExists.c.o -c /home/koti/buildroot-desktop/buildroot/output/build/host-llvm-15.0.0/buildroot-build/CMakeFiles/CMakeTmp/CheckSymbolExists.c
Linking C executable cmTC_33489
/usr/bin/cmake -E cmake_link_script CMakeFiles/cmTC_33489.dir/link.txt --verbose=1
/usr/bin/gcc -O2 -I/home/koti/buildroot-desktop/buildroot/output/host/include -L/home/koti/buildroot-desktop/buildroot/output/host/lib -Wl,-rpath,/home/koti/buildroot-desktop/buildroot/output/host/lib CMakeFiles/cmTC_33489.dir/CheckSymbolExists.c.o -o cmTC_33489 -lm
gmake[3]: Leaving directory ‘/home/koti/buildroot-desktop/buildroot/output/build/host-llvm-15.0.0/buildroot-build/CMakeFiles/CMakeTmp’
gmake[2]: Leaving directory ‘/home/koti/buildroot-desktop/buildroot/output/build/host-llvm-15.0.0/buildroot-build/CMakeFiles/CMakeTmp’

File /home/koti/buildroot-desktop/buildroot/output/build/host-llvm-15.0.0/buildroot-build/CMakeFiles/CMakeTmp/CheckSymbolExists.c:
/* */
#include <unwind.h>

int main(int argc, char** argv)
{
(void)argv;
#ifndef _Unwind_Backtrace
return ((int*)(&_Unwind_Backtrace))[argc];
#else
(void)argc;
return 0;
#endif
}
Determining if the getpagesize exist passed with the following output:
Change Dir: /home/koti/buildroot-desktop/buildroot/output/build/host-llvm-15.0.0/buildroot-build/CMakeFiles/CMakeTmp

Run Build Command(s):/usr/bin/gmake -f Makefile cmTC_9a311/fast && gmake[2]: Entering directory ‘/home/koti/buildroot-desktop/buildroot/output/build/host-llvm-15.0.0/buildroot-build/CMakeFiles/CMakeTmp’
/usr/bin/gmake -f CMakeFiles/cmTC_9a311.dir/build.make CMakeFiles/cmTC_9a311.dir/build
gmake[3]: Entering directory ‘/home/koti/buildroot-desktop/buildroot/output/build/host-llvm-15.0.0/buildroot-build/CMakeFiles/CMakeTmp’
Building C object CMakeFiles/cmTC_9a311.dir/CheckSymbolExists.c.o
/usr/bin/gcc -O2 -I/home/koti/buildroot-desktop/buildroot/output/host/include -o CMakeFiles/cmTC_9a311.dir/CheckSymbolExists.c.o -c /home/koti/buildroot-desktop/buildroot/output/build/host-llvm-15.0.0/buildroot-build/CMakeFiles/CMakeTmp/CheckSymbolExists.c
Linking C executable cmTC_9a311
/usr/bin/cmake -E cmake_link_script CMakeFiles/cmTC_9a311.dir/link.txt --verbose=1
/usr/bin/gcc -O2 -I/home/koti/buildroot-desktop/buildroot/output/host/include -L/home/koti/buildroot-desktop/buildroot/output/host/lib -Wl,-rpath,/home/koti/buildroot-desktop/buildroot/output/host/lib CMakeFiles/cmTC_9a311.dir/CheckSymbolExists.c.o -o cmTC_9a311 -lm
gmake[3]: Leaving directory ‘/home/koti/buildroot-desktop/buildroot/output/build/host-llvm-15.0.0/buildroot-build/CMakeFiles/CMakeTmp’
gmake[2]: Leaving directory ‘/home/koti/buildroot-desktop/buildroot/output/build/host-llvm-15.0.0/buildroot-build/CMakeFiles/CMakeTmp’

File /home/koti/buildroot-desktop/buildroot/output/build/host-llvm-15.0.0/buildroot-build/CMakeFiles/CMakeTmp/CheckSymbolExists.c:
/* */
#include <unistd.h>

int main(int argc, char** argv)
{
(void)argv;
#ifndef getpagesize
return ((int*)(&getpagesize))[argc];
#else
(void)argc;
return 0;
#endif
}
Determining if the sysconf exist passed with the following output:
Change Dir: /home/koti/buildroot-desktop/buildroot/output/build/host-llvm-15.0.0/buildroot-build/CMakeFiles/CMakeTmp

Run Build Command(s):/usr/bin/gmake -f Makefile cmTC_f9384/fast && gmake[2]: Entering directory ‘/home/koti/buildroot-desktop/buildroot/output/build/host-llvm-15.0.0/buildroot-build/CMakeFiles/CMakeTmp’
/usr/bin/gmake -f CMakeFiles/cmTC_f9384.dir/build.make CMakeFiles/cmTC_f9384.dir/build
gmake[3]: Entering directory ‘/home/koti/buildroot-desktop/buildroot/output/build/host-llvm-15.0.0/buildroot-build/CMakeFiles/CMakeTmp’
Building C object CMakeFiles/cmTC_f9384.dir/CheckSymbolExists.c.o
/usr/bin/gcc -O2 -I/home/koti/buildroot-desktop/buildroot/output/host/include -o CMakeFiles/cmTC_f9384.dir/CheckSymbolExists.c.o -c /home/koti/buildroot-desktop/buildroot/output/build/host-llvm-15.0.0/buildroot-build/CMakeFiles/CMakeTmp/CheckSymbolExists.c
Linking C executable cmTC_f9384
/usr/bin/cmake -E cmake_link_script CMakeFiles/cmTC_f9384.dir/link.txt --verbose=1
/usr/bin/gcc -O2 -I/home/koti/buildroot-desktop/buildroot/output/host/include -L/home/koti/buildroot-desktop/buildroot/output/host/lib -Wl,-rpath,/home/koti/buildroot-desktop/buildroot/output/host/lib CMakeFiles/cmTC_f9384.dir/CheckSymbolExists.c.o -o cmTC_f9384 -lm
gmake[3]: Leaving directory ‘/home/koti/buildroot-desktop/buildroot/output/build/host-llvm-15.0.0/buildroot-build/CMakeFiles/CMakeTmp’
gmake[2]: Leaving directory ‘/home/koti/buildroot-desktop/buildroot/output/build/host-llvm-15.0.0/buildroot-build/CMakeFiles/CMakeTmp’

File /home/koti/buildroot-desktop/buildroot/output/build/host-llvm-15.0.0/buildroot-build/CMakeFiles/CMakeTmp/CheckSymbolExists.c:
/* */
#include <unistd.h>

int main(int argc, char** argv)
{
(void)argv;
#ifndef sysconf
return ((int*)(&sysconf))[argc];
#else
(void)argc;
return 0;
#endif
}
Determining if the getrusage exist passed with the following output:
Change Dir: /home/koti/buildroot-desktop/buildroot/output/build/host-llvm-15.0.0/buildroot-build/CMakeFiles/CMakeTmp

Run Build Command(s):/usr/bin/gmake -f Makefile cmTC_44aba/fast && gmake[2]: Entering directory ‘/home/koti/buildroot-desktop/buildroot/output/build/host-llvm-15.0.0/buildroot-build/CMakeFiles/CMakeTmp’
/usr/bin/gmake -f CMakeFiles/cmTC_44aba.dir/build.make CMakeFiles/cmTC_44aba.dir/build
gmake[3]: Entering directory ‘/home/koti/buildroot-desktop/buildroot/output/build/host-llvm-15.0.0/buildroot-build/CMakeFiles/CMakeTmp’
Building C object CMakeFiles/cmTC_44aba.dir/CheckSymbolExists.c.o
/usr/bin/gcc -O2 -I/home/koti/buildroot-desktop/buildroot/output/host/include -o CMakeFiles/cmTC_44aba.dir/CheckSymbolExists.c.o -c /home/koti/buildroot-desktop/buildroot/output/build/host-llvm-15.0.0/buildroot-build/CMakeFiles/CMakeTmp/CheckSymbolExists.c
Linking C executable cmTC_44aba
/usr/bin/cmake -E cmake_link_script CMakeFiles/cmTC_44aba.dir/link.txt --verbose=1
/usr/bin/gcc -O2 -I/home/koti/buildroot-desktop/buildroot/output/host/include -L/home/koti/buildroot-desktop/buildroot/output/host/lib -Wl,-rpath,/home/koti/buildroot-desktop/buildroot/output/host/lib CMakeFiles/cmTC_44aba.dir/CheckSymbolExists.c.o -o cmTC_44aba -lm
gmake[3]: Leaving directory ‘/home/koti/buildroot-desktop/buildroot/output/build/host-llvm-15.0.0/buildroot-build/CMakeFiles/CMakeTmp’
gmake[2]: Leaving directory ‘/home/koti/buildroot-desktop/buildroot/output/build/host-llvm-15.0.0/buildroot-build/CMakeFiles/CMakeTmp’

File /home/koti/buildroot-desktop/buildroot/output/build/host-llvm-15.0.0/buildroot-build/CMakeFiles/CMakeTmp/CheckSymbolExists.c:
/* */
#include <sys/resource.h>

int main(int argc, char** argv)
{
(void)argv;
#ifndef getrusage
return ((int*)(&getrusage))[argc];
#else
(void)argc;
return 0;
#endif
}
Determining if the setrlimit exist passed with the following output:
Change Dir: /home/koti/buildroot-desktop/buildroot/output/build/host-llvm-15.0.0/buildroot-build/CMakeFiles/CMakeTmp

Run Build Command(s):/usr/bin/gmake -f Makefile cmTC_863a3/fast && gmake[2]: Entering directory ‘/home/koti/buildroot-desktop/buildroot/output/build/host-llvm-15.0.0/buildroot-build/CMakeFiles/CMakeTmp’
/usr/bin/gmake -f CMakeFiles/cmTC_863a3.dir/build.make CMakeFiles/cmTC_863a3.dir/build
gmake[3]: Entering directory ‘/home/koti/buildroot-desktop/buildroot/output/build/host-llvm-15.0.0/buildroot-build/CMakeFiles/CMakeTmp’
Building C object CMakeFiles/cmTC_863a3.dir/CheckSymbolExists.c.o
/usr/bin/gcc -O2 -I/home/koti/buildroot-desktop/buildroot/output/host/include -o CMakeFiles/cmTC_863a3.dir/CheckSymbolExists.c.o -c /home/koti/buildroot-desktop/buildroot/output/build/host-llvm-15.0.0/buildroot-build/CMakeFiles/CMakeTmp/CheckSymbolExists.c
Linking C executable cmTC_863a3
/usr/bin/cmake -E cmake_link_script CMakeFiles/cmTC_863a3.dir/link.txt --verbose=1
/usr/bin/gcc -O2 -I/home/koti/buildroot-desktop/buildroot/output/host/include -L/home/koti/buildroot-desktop/buildroot/output/host/lib -Wl,-rpath,/home/koti/buildroot-desktop/buildroot/output/host/lib CMakeFiles/cmTC_863a3.dir/CheckSymbolExists.c.o -o cmTC_863a3 -lm
gmake[3]: Leaving directory ‘/home/koti/buildroot-desktop/buildroot/output/build/host-llvm-15.0.0/buildroot-build/CMakeFiles/CMakeTmp’
gmake[2]: Leaving directory ‘/home/koti/buildroot-desktop/buildroot/output/build/host-llvm-15.0.0/buildroot-build/CMakeFiles/CMakeTmp’

File /home/koti/buildroot-desktop/buildroot/output/build/host-llvm-15.0.0/buildroot-build/CMakeFiles/CMakeTmp/CheckSymbolExists.c:
/* */
#include <sys/resource.h>

int main(int argc, char** argv)
{
(void)argv;
#ifndef setrlimit
return ((int*)(&setrlimit))[argc];
#else
(void)argc;
return 0;
#endif
}
Determining if the isatty exist passed with the following output:
Change Dir: /home/koti/buildroot-desktop/buildroot/output/build/host-llvm-15.0.0/buildroot-build/CMakeFiles/CMakeTmp

Run Build Command(s):/usr/bin/gmake -f Makefile cmTC_216a4/fast && gmake[2]: Entering directory ‘/home/koti/buildroot-desktop/buildroot/output/build/host-llvm-15.0.0/buildroot-build/CMakeFiles/CMakeTmp’
/usr/bin/gmake -f CMakeFiles/cmTC_216a4.dir/build.make CMakeFiles/cmTC_216a4.dir/build
gmake[3]: Entering directory ‘/home/koti/buildroot-desktop/buildroot/output/build/host-llvm-15.0.0/buildroot-build/CMakeFiles/CMakeTmp’
Building C object CMakeFiles/cmTC_216a4.dir/CheckSymbolExists.c.o
/usr/bin/gcc -O2 -I/home/koti/buildroot-desktop/buildroot/output/host/include -o CMakeFiles/cmTC_216a4.dir/CheckSymbolExists.c.o -c /home/koti/buildroot-desktop/buildroot/output/build/host-llvm-15.0.0/buildroot-build/CMakeFiles/CMakeTmp/CheckSymbolExists.c
Linking C executable cmTC_216a4
/usr/bin/cmake -E cmake_link_script CMakeFiles/cmTC_216a4.dir/link.txt --verbose=1
/usr/bin/gcc -O2 -I/home/koti/buildroot-desktop/buildroot/output/host/include -L/home/koti/buildroot-desktop/buildroot/output/host/lib -Wl,-rpath,/home/koti/buildroot-desktop/buildroot/output/host/lib CMakeFiles/cmTC_216a4.dir/CheckSymbolExists.c.o -o cmTC_216a4 -lm
gmake[3]: Leaving directory ‘/home/koti/buildroot-desktop/buildroot/output/build/host-llvm-15.0.0/buildroot-build/CMakeFiles/CMakeTmp’
gmake[2]: Leaving directory ‘/home/koti/buildroot-desktop/buildroot/output/build/host-llvm-15.0.0/buildroot-build/CMakeFiles/CMakeTmp’

File /home/koti/buildroot-desktop/buildroot/output/build/host-llvm-15.0.0/buildroot-build/CMakeFiles/CMakeTmp/CheckSymbolExists.c:
/* */
#include <unistd.h>

int main(int argc, char** argv)
{
(void)argv;
#ifndef isatty
return ((int*)(&isatty))[argc];
#else
(void)argc;
return 0;
#endif
}
Determining if the futimens exist passed with the following output:
Change Dir: /home/koti/buildroot-desktop/buildroot/output/build/host-llvm-15.0.0/buildroot-build/CMakeFiles/CMakeTmp

Run Build Command(s):/usr/bin/gmake -f Makefile cmTC_7a0d9/fast && gmake[2]: Entering directory ‘/home/koti/buildroot-desktop/buildroot/output/build/host-llvm-15.0.0/buildroot-build/CMakeFiles/CMakeTmp’
/usr/bin/gmake -f CMakeFiles/cmTC_7a0d9.dir/build.make CMakeFiles/cmTC_7a0d9.dir/build
gmake[3]: Entering directory ‘/home/koti/buildroot-desktop/buildroot/output/build/host-llvm-15.0.0/buildroot-build/CMakeFiles/CMakeTmp’
Building C object CMakeFiles/cmTC_7a0d9.dir/CheckSymbolExists.c.o
/usr/bin/gcc -O2 -I/home/koti/buildroot-desktop/buildroot/output/host/include -o CMakeFiles/cmTC_7a0d9.dir/CheckSymbolExists.c.o -c /home/koti/buildroot-desktop/buildroot/output/build/host-llvm-15.0.0/buildroot-build/CMakeFiles/CMakeTmp/CheckSymbolExists.c
Linking C executable cmTC_7a0d9
/usr/bin/cmake -E cmake_link_script CMakeFiles/cmTC_7a0d9.dir/link.txt --verbose=1
/usr/bin/gcc -O2 -I/home/koti/buildroot-desktop/buildroot/output/host/include -L/home/koti/buildroot-desktop/buildroot/output/host/lib -Wl,-rpath,/home/koti/buildroot-desktop/buildroot/output/host/lib CMakeFiles/cmTC_7a0d9.dir/CheckSymbolExists.c.o -o cmTC_7a0d9 -lm
gmake[3]: Leaving directory ‘/home/koti/buildroot-desktop/buildroot/output/build/host-llvm-15.0.0/buildroot-build/CMakeFiles/CMakeTmp’
gmake[2]: Leaving directory ‘/home/koti/buildroot-desktop/buildroot/output/build/host-llvm-15.0.0/buildroot-build/CMakeFiles/CMakeTmp’

File /home/koti/buildroot-desktop/buildroot/output/build/host-llvm-15.0.0/buildroot-build/CMakeFiles/CMakeTmp/CheckSymbolExists.c:
/* */
#include <sys/stat.h>

int main(int argc, char** argv)
{
(void)argv;
#ifndef futimens
return ((int*)(&futimens))[argc];
#else
(void)argc;
return 0;
#endif
}
Determining if the futimes exist passed with the following output:
Change Dir: /home/koti/buildroot-desktop/buildroot/output/build/host-llvm-15.0.0/buildroot-build/CMakeFiles/CMakeTmp

Run Build Command(s):/usr/bin/gmake -f Makefile cmTC_bd2e0/fast && gmake[2]: Entering directory ‘/home/koti/buildroot-desktop/buildroot/output/build/host-llvm-15.0.0/buildroot-build/CMakeFiles/CMakeTmp’
/usr/bin/gmake -f CMakeFiles/cmTC_bd2e0.dir/build.make CMakeFiles/cmTC_bd2e0.dir/build
gmake[3]: Entering directory ‘/home/koti/buildroot-desktop/buildroot/output/build/host-llvm-15.0.0/buildroot-build/CMakeFiles/CMakeTmp’
Building C object CMakeFiles/cmTC_bd2e0.dir/CheckSymbolExists.c.o
/usr/bin/gcc -O2 -I/home/koti/buildroot-desktop/buildroot/output/host/include -o CMakeFiles/cmTC_bd2e0.dir/CheckSymbolExists.c.o -c /home/koti/buildroot-desktop/buildroot/output/build/host-llvm-15.0.0/buildroot-build/CMakeFiles/CMakeTmp/CheckSymbolExists.c
Linking C executable cmTC_bd2e0
/usr/bin/cmake -E cmake_link_script CMakeFiles/cmTC_bd2e0.dir/link.txt --verbose=1
/usr/bin/gcc -O2 -I/home/koti/buildroot-desktop/buildroot/output/host/include -L/home/koti/buildroot-desktop/buildroot/output/host/lib -Wl,-rpath,/home/koti/buildroot-desktop/buildroot/output/host/lib CMakeFiles/cmTC_bd2e0.dir/CheckSymbolExists.c.o -o cmTC_bd2e0 -lm
gmake[3]: Leaving directory ‘/home/koti/buildroot-desktop/buildroot/output/build/host-llvm-15.0.0/buildroot-build/CMakeFiles/CMakeTmp’
gmake[2]: Leaving directory ‘/home/koti/buildroot-desktop/buildroot/output/build/host-llvm-15.0.0/buildroot-build/CMakeFiles/CMakeTmp’

File /home/koti/buildroot-desktop/buildroot/output/build/host-llvm-15.0.0/buildroot-build/CMakeFiles/CMakeTmp/CheckSymbolExists.c:
/* */
#include <sys/time.h>

int main(int argc, char** argv)
{
(void)argv;
#ifndef futimes
return ((int*)(&futimes))[argc];
#else
(void)argc;
return 0;
#endif
}
Determining if the sigaltstack exist passed with the following output:
Change Dir: /home/koti/buildroot-desktop/buildroot/output/build/host-llvm-15.0.0/buildroot-build/CMakeFiles/CMakeTmp

Run Build Command(s):/usr/bin/gmake -f Makefile cmTC_f3090/fast && gmake[2]: Entering directory ‘/home/koti/buildroot-desktop/buildroot/output/build/host-llvm-15.0.0/buildroot-build/CMakeFiles/CMakeTmp’
/usr/bin/gmake -f CMakeFiles/cmTC_f3090.dir/build.make CMakeFiles/cmTC_f3090.dir/build
gmake[3]: Entering directory ‘/home/koti/buildroot-desktop/buildroot/output/build/host-llvm-15.0.0/buildroot-build/CMakeFiles/CMakeTmp’
Building C object CMakeFiles/cmTC_f3090.dir/CheckSymbolExists.c.o
/usr/bin/gcc -O2 -I/home/koti/buildroot-desktop/buildroot/output/host/include -o CMakeFiles/cmTC_f3090.dir/CheckSymbolExists.c.o -c /home/koti/buildroot-desktop/buildroot/output/build/host-llvm-15.0.0/buildroot-build/CMakeFiles/CMakeTmp/CheckSymbolExists.c
Linking C executable cmTC_f3090
/usr/bin/cmake -E cmake_link_script CMakeFiles/cmTC_f3090.dir/link.txt --verbose=1
/usr/bin/gcc -O2 -I/home/koti/buildroot-desktop/buildroot/output/host/include -L/home/koti/buildroot-desktop/buildroot/output/host/lib -Wl,-rpath,/home/koti/buildroot-desktop/buildroot/output/host/lib CMakeFiles/cmTC_f3090.dir/CheckSymbolExists.c.o -o cmTC_f3090 -lm
gmake[3]: Leaving directory ‘/home/koti/buildroot-desktop/buildroot/output/build/host-llvm-15.0.0/buildroot-build/CMakeFiles/CMakeTmp’
gmake[2]: Leaving directory ‘/home/koti/buildroot-desktop/buildroot/output/build/host-llvm-15.0.0/buildroot-build/CMakeFiles/CMakeTmp’

File /home/koti/buildroot-desktop/buildroot/output/build/host-llvm-15.0.0/buildroot-build/CMakeFiles/CMakeTmp/CheckSymbolExists.c:
/* */
#include <signal.h>

int main(int argc, char** argv)
{
(void)argv;
#ifndef sigaltstack
return ((int*)(&sigaltstack))[argc];
#else
(void)argc;
return 0;
#endif
}
Determining if the lseek64 exist passed with the following output:
Change Dir: /home/koti/buildroot-desktop/buildroot/output/build/host-llvm-15.0.0/buildroot-build/CMakeFiles/CMakeTmp

Run Build Command(s):/usr/bin/gmake -f Makefile cmTC_01b5b/fast && gmake[2]: Entering directory ‘/home/koti/buildroot-desktop/buildroot/output/build/host-llvm-15.0.0/buildroot-build/CMakeFiles/CMakeTmp’
/usr/bin/gmake -f CMakeFiles/cmTC_01b5b.dir/build.make CMakeFiles/cmTC_01b5b.dir/build
gmake[3]: Entering directory ‘/home/koti/buildroot-desktop/buildroot/output/build/host-llvm-15.0.0/buildroot-build/CMakeFiles/CMakeTmp’
Building C object CMakeFiles/cmTC_01b5b.dir/CheckSymbolExists.c.o
/usr/bin/gcc -D_LARGEFILE64_SOURCE -O2 -I/home/koti/buildroot-desktop/buildroot/output/host/include -o CMakeFiles/cmTC_01b5b.dir/CheckSymbolExists.c.o -c /home/koti/buildroot-desktop/buildroot/output/build/host-llvm-15.0.0/buildroot-build/CMakeFiles/CMakeTmp/CheckSymbolExists.c
Linking C executable cmTC_01b5b
/usr/bin/cmake -E cmake_link_script CMakeFiles/cmTC_01b5b.dir/link.txt --verbose=1
/usr/bin/gcc -O2 -I/home/koti/buildroot-desktop/buildroot/output/host/include -L/home/koti/buildroot-desktop/buildroot/output/host/lib -Wl,-rpath,/home/koti/buildroot-desktop/buildroot/output/host/lib CMakeFiles/cmTC_01b5b.dir/CheckSymbolExists.c.o -o cmTC_01b5b -lm
gmake[3]: Leaving directory ‘/home/koti/buildroot-desktop/buildroot/output/build/host-llvm-15.0.0/buildroot-build/CMakeFiles/CMakeTmp’
gmake[2]: Leaving directory ‘/home/koti/buildroot-desktop/buildroot/output/build/host-llvm-15.0.0/buildroot-build/CMakeFiles/CMakeTmp’

File /home/koti/buildroot-desktop/buildroot/output/build/host-llvm-15.0.0/buildroot-build/CMakeFiles/CMakeTmp/CheckSymbolExists.c:
/* */
#include <sys/types.h>
#include <unistd.h>

int main(int argc, char** argv)
{
(void)argv;
#ifndef lseek64
return ((int*)(&lseek64))[argc];
#else
(void)argc;
return 0;
#endif
}
Determining if the mallinfo exist passed with the following output:
Change Dir: /home/koti/buildroot-desktop/buildroot/output/build/host-llvm-15.0.0/buildroot-build/CMakeFiles/CMakeTmp

Run Build Command(s):/usr/bin/gmake -f Makefile cmTC_8b515/fast && gmake[2]: Entering directory ‘/home/koti/buildroot-desktop/buildroot/output/build/host-llvm-15.0.0/buildroot-build/CMakeFiles/CMakeTmp’
/usr/bin/gmake -f CMakeFiles/cmTC_8b515.dir/build.make CMakeFiles/cmTC_8b515.dir/build
gmake[3]: Entering directory ‘/home/koti/buildroot-desktop/buildroot/output/build/host-llvm-15.0.0/buildroot-build/CMakeFiles/CMakeTmp’
Building C object CMakeFiles/cmTC_8b515.dir/CheckSymbolExists.c.o
/usr/bin/gcc -O2 -I/home/koti/buildroot-desktop/buildroot/output/host/include -o CMakeFiles/cmTC_8b515.dir/CheckSymbolExists.c.o -c /home/koti/buildroot-desktop/buildroot/output/build/host-llvm-15.0.0/buildroot-build/CMakeFiles/CMakeTmp/CheckSymbolExists.c
/home/koti/buildroot-desktop/buildroot/output/build/host-llvm-15.0.0/buildroot-build/CMakeFiles/CMakeTmp/CheckSymbolExists.c: In function ‘main’:
/home/koti/buildroot-desktop/buildroot/output/build/host-llvm-15.0.0/buildroot-build/CMakeFiles/CMakeTmp/CheckSymbolExists.c:8:3: warning: ‘mallinfo’ is deprecated [-Wdeprecated-declarations]
8 | return ((int*)(&mallinfo))[argc];
| ^~~~~~
In file included from /home/koti/buildroot-desktop/buildroot/output/build/host-llvm-15.0.0/buildroot-build/CMakeFiles/CMakeTmp/CheckSymbolExists.c:2:
/usr/include/malloc.h:114:24: note: declared here
114 | extern struct mallinfo mallinfo (void) __THROW __MALLOC_DEPRECATED;
| ^~~~~~~~
Linking C executable cmTC_8b515
/usr/bin/cmake -E cmake_link_script CMakeFiles/cmTC_8b515.dir/link.txt --verbose=1
/usr/bin/gcc -O2 -I/home/koti/buildroot-desktop/buildroot/output/host/include -L/home/koti/buildroot-desktop/buildroot/output/host/lib -Wl,-rpath,/home/koti/buildroot-desktop/buildroot/output/host/lib CMakeFiles/cmTC_8b515.dir/CheckSymbolExists.c.o -o cmTC_8b515 -lm
gmake[3]: Leaving directory ‘/home/koti/buildroot-desktop/buildroot/output/build/host-llvm-15.0.0/buildroot-build/CMakeFiles/CMakeTmp’
gmake[2]: Leaving directory ‘/home/koti/buildroot-desktop/buildroot/output/build/host-llvm-15.0.0/buildroot-build/CMakeFiles/CMakeTmp’

File /home/koti/buildroot-desktop/buildroot/output/build/host-llvm-15.0.0/buildroot-build/CMakeFiles/CMakeTmp/CheckSymbolExists.c:
/* */
#include <malloc.h>

int main(int argc, char** argv)
{
(void)argv;
#ifndef mallinfo
return ((int*)(&mallinfo))[argc];
#else
(void)argc;
return 0;
#endif
}
Determining if the mallinfo2 exist passed with the following output:
Change Dir: /home/koti/buildroot-desktop/buildroot/output/build/host-llvm-15.0.0/buildroot-build/CMakeFiles/CMakeTmp

Run Build Command(s):/usr/bin/gmake -f Makefile cmTC_c5764/fast && gmake[2]: Entering directory ‘/home/koti/buildroot-desktop/buildroot/output/build/host-llvm-15.0.0/buildroot-build/CMakeFiles/CMakeTmp’
/usr/bin/gmake -f CMakeFiles/cmTC_c5764.dir/build.make CMakeFiles/cmTC_c5764.dir/build
gmake[3]: Entering directory ‘/home/koti/buildroot-desktop/buildroot/output/build/host-llvm-15.0.0/buildroot-build/CMakeFiles/CMakeTmp’
Building C object CMakeFiles/cmTC_c5764.dir/CheckSymbolExists.c.o
/usr/bin/gcc -O2 -I/home/koti/buildroot-desktop/buildroot/output/host/include -o CMakeFiles/cmTC_c5764.dir/CheckSymbolExists.c.o -c /home/koti/buildroot-desktop/buildroot/output/build/host-llvm-15.0.0/buildroot-build/CMakeFiles/CMakeTmp/CheckSymbolExists.c
Linking C executable cmTC_c5764
/usr/bin/cmake -E cmake_link_script CMakeFiles/cmTC_c5764.dir/link.txt --verbose=1
/usr/bin/gcc -O2 -I/home/koti/buildroot-desktop/buildroot/output/host/include -L/home/koti/buildroot-desktop/buildroot/output/host/lib -Wl,-rpath,/home/koti/buildroot-desktop/buildroot/output/host/lib CMakeFiles/cmTC_c5764.dir/CheckSymbolExists.c.o -o cmTC_c5764 -lm
gmake[3]: Leaving directory ‘/home/koti/buildroot-desktop/buildroot/output/build/host-llvm-15.0.0/buildroot-build/CMakeFiles/CMakeTmp’
gmake[2]: Leaving directory ‘/home/koti/buildroot-desktop/buildroot/output/build/host-llvm-15.0.0/buildroot-build/CMakeFiles/CMakeTmp’

File /home/koti/buildroot-desktop/buildroot/output/build/host-llvm-15.0.0/buildroot-build/CMakeFiles/CMakeTmp/CheckSymbolExists.c:
/* */
#include <malloc.h>

int main(int argc, char** argv)
{
(void)argv;
#ifndef mallinfo2
return ((int*)(&mallinfo2))[argc];
#else
(void)argc;
return 0;
#endif
}
Determining if the getrlimit exist passed with the following output:
Change Dir: /home/koti/buildroot-desktop/buildroot/output/build/host-llvm-15.0.0/buildroot-build/CMakeFiles/CMakeTmp

Run Build Command(s):/usr/bin/gmake -f Makefile cmTC_503e9/fast && gmake[2]: Entering directory ‘/home/koti/buildroot-desktop/buildroot/output/build/host-llvm-15.0.0/buildroot-build/CMakeFiles/CMakeTmp’
/usr/bin/gmake -f CMakeFiles/cmTC_503e9.dir/build.make CMakeFiles/cmTC_503e9.dir/build
gmake[3]: Entering directory ‘/home/koti/buildroot-desktop/buildroot/output/build/host-llvm-15.0.0/buildroot-build/CMakeFiles/CMakeTmp’
Building C object CMakeFiles/cmTC_503e9.dir/CheckSymbolExists.c.o
/usr/bin/gcc -O2 -I/home/koti/buildroot-desktop/buildroot/output/host/include -o CMakeFiles/cmTC_503e9.dir/CheckSymbolExists.c.o -c /home/koti/buildroot-desktop/buildroot/output/build/host-llvm-15.0.0/buildroot-build/CMakeFiles/CMakeTmp/CheckSymbolExists.c
Linking C executable cmTC_503e9
/usr/bin/cmake -E cmake_link_script CMakeFiles/cmTC_503e9.dir/link.txt --verbose=1
/usr/bin/gcc -O2 -I/home/koti/buildroot-desktop/buildroot/output/host/include -L/home/koti/buildroot-desktop/buildroot/output/host/lib -Wl,-rpath,/home/koti/buildroot-desktop/buildroot/output/host/lib CMakeFiles/cmTC_503e9.dir/CheckSymbolExists.c.o -o cmTC_503e9 -lm
gmake[3]: Leaving directory ‘/home/koti/buildroot-desktop/buildroot/output/build/host-llvm-15.0.0/buildroot-build/CMakeFiles/CMakeTmp’
gmake[2]: Leaving directory ‘/home/koti/buildroot-desktop/buildroot/output/build/host-llvm-15.0.0/buildroot-build/CMakeFiles/CMakeTmp’

File /home/koti/buildroot-desktop/buildroot/output/build/host-llvm-15.0.0/buildroot-build/CMakeFiles/CMakeTmp/CheckSymbolExists.c:
/* */
#include <sys/types.h>
#include <sys/time.h>
#include <sys/resource.h>

int main(int argc, char** argv)
{
(void)argv;
#ifndef getrlimit
return ((int*)(&getrlimit))[argc];
#else
(void)argc;
return 0;
#endif
}
Determining if the posix_spawn exist passed with the following output:
Change Dir: /home/koti/buildroot-desktop/buildroot/output/build/host-llvm-15.0.0/buildroot-build/CMakeFiles/CMakeTmp

Run Build Command(s):/usr/bin/gmake -f Makefile cmTC_af93e/fast && gmake[2]: Entering directory ‘/home/koti/buildroot-desktop/buildroot/output/build/host-llvm-15.0.0/buildroot-build/CMakeFiles/CMakeTmp’
/usr/bin/gmake -f CMakeFiles/cmTC_af93e.dir/build.make CMakeFiles/cmTC_af93e.dir/build
gmake[3]: Entering directory ‘/home/koti/buildroot-desktop/buildroot/output/build/host-llvm-15.0.0/buildroot-build/CMakeFiles/CMakeTmp’
Building C object CMakeFiles/cmTC_af93e.dir/CheckSymbolExists.c.o
/usr/bin/gcc -O2 -I/home/koti/buildroot-desktop/buildroot/output/host/include -o CMakeFiles/cmTC_af93e.dir/CheckSymbolExists.c.o -c /home/koti/buildroot-desktop/buildroot/output/build/host-llvm-15.0.0/buildroot-build/CMakeFiles/CMakeTmp/CheckSymbolExists.c
Linking C executable cmTC_af93e
/usr/bin/cmake -E cmake_link_script CMakeFiles/cmTC_af93e.dir/link.txt --verbose=1
/usr/bin/gcc -O2 -I/home/koti/buildroot-desktop/buildroot/output/host/include -L/home/koti/buildroot-desktop/buildroot/output/host/lib -Wl,-rpath,/home/koti/buildroot-desktop/buildroot/output/host/lib CMakeFiles/cmTC_af93e.dir/CheckSymbolExists.c.o -o cmTC_af93e -lm
gmake[3]: Leaving directory ‘/home/koti/buildroot-desktop/buildroot/output/build/host-llvm-15.0.0/buildroot-build/CMakeFiles/CMakeTmp’
gmake[2]: Leaving directory ‘/home/koti/buildroot-desktop/buildroot/output/build/host-llvm-15.0.0/buildroot-build/CMakeFiles/CMakeTmp’

File /home/koti/buildroot-desktop/buildroot/output/build/host-llvm-15.0.0/buildroot-build/CMakeFiles/CMakeTmp/CheckSymbolExists.c:
/* */
#include <spawn.h>

int main(int argc, char** argv)
{
(void)argv;
#ifndef posix_spawn
return ((int*)(&posix_spawn))[argc];
#else
(void)argc;
return 0;
#endif
}
Determining if the pread exist passed with the following output:
Change Dir: /home/koti/buildroot-desktop/buildroot/output/build/host-llvm-15.0.0/buildroot-build/CMakeFiles/CMakeTmp

Run Build Command(s):/usr/bin/gmake -f Makefile cmTC_2b890/fast && gmake[2]: Entering directory ‘/home/koti/buildroot-desktop/buildroot/output/build/host-llvm-15.0.0/buildroot-build/CMakeFiles/CMakeTmp’
/usr/bin/gmake -f CMakeFiles/cmTC_2b890.dir/build.make CMakeFiles/cmTC_2b890.dir/build
gmake[3]: Entering directory ‘/home/koti/buildroot-desktop/buildroot/output/build/host-llvm-15.0.0/buildroot-build/CMakeFiles/CMakeTmp’
Building C object CMakeFiles/cmTC_2b890.dir/CheckSymbolExists.c.o
/usr/bin/gcc -O2 -I/home/koti/buildroot-desktop/buildroot/output/host/include -o CMakeFiles/cmTC_2b890.dir/CheckSymbolExists.c.o -c /home/koti/buildroot-desktop/buildroot/output/build/host-llvm-15.0.0/buildroot-build/CMakeFiles/CMakeTmp/CheckSymbolExists.c
Linking C executable cmTC_2b890
/usr/bin/cmake -E cmake_link_script CMakeFiles/cmTC_2b890.dir/link.txt --verbose=1
/usr/bin/gcc -O2 -I/home/koti/buildroot-desktop/buildroot/output/host/include -L/home/koti/buildroot-desktop/buildroot/output/host/lib -Wl,-rpath,/home/koti/buildroot-desktop/buildroot/output/host/lib CMakeFiles/cmTC_2b890.dir/CheckSymbolExists.c.o -o cmTC_2b890 -lm
gmake[3]: Leaving directory ‘/home/koti/buildroot-desktop/buildroot/output/build/host-llvm-15.0.0/buildroot-build/CMakeFiles/CMakeTmp’
gmake[2]: Leaving directory ‘/home/koti/buildroot-desktop/buildroot/output/build/host-llvm-15.0.0/buildroot-build/CMakeFiles/CMakeTmp’

File /home/koti/buildroot-desktop/buildroot/output/build/host-llvm-15.0.0/buildroot-build/CMakeFiles/CMakeTmp/CheckSymbolExists.c:
/* */
#include <unistd.h>

int main(int argc, char** argv)
{
(void)argv;
#ifndef pread
return ((int*)(&pread))[argc];
#else
(void)argc;
return 0;
#endif
}
Determining if the sbrk exist passed with the following output:
Change Dir: /home/koti/buildroot-desktop/buildroot/output/build/host-llvm-15.0.0/buildroot-build/CMakeFiles/CMakeTmp

Run Build Command(s):/usr/bin/gmake -f Makefile cmTC_d27c7/fast && gmake[2]: Entering directory ‘/home/koti/buildroot-desktop/buildroot/output/build/host-llvm-15.0.0/buildroot-build/CMakeFiles/CMakeTmp’
/usr/bin/gmake -f CMakeFiles/cmTC_d27c7.dir/build.make CMakeFiles/cmTC_d27c7.dir/build
gmake[3]: Entering directory ‘/home/koti/buildroot-desktop/buildroot/output/build/host-llvm-15.0.0/buildroot-build/CMakeFiles/CMakeTmp’
Building C object CMakeFiles/cmTC_d27c7.dir/CheckSymbolExists.c.o
/usr/bin/gcc -O2 -I/home/koti/buildroot-desktop/buildroot/output/host/include -o CMakeFiles/cmTC_d27c7.dir/CheckSymbolExists.c.o -c /home/koti/buildroot-desktop/buildroot/output/build/host-llvm-15.0.0/buildroot-build/CMakeFiles/CMakeTmp/CheckSymbolExists.c
Linking C executable cmTC_d27c7
/usr/bin/cmake -E cmake_link_script CMakeFiles/cmTC_d27c7.dir/link.txt --verbose=1
/usr/bin/gcc -O2 -I/home/koti/buildroot-desktop/buildroot/output/host/include -L/home/koti/buildroot-desktop/buildroot/output/host/lib -Wl,-rpath,/home/koti/buildroot-desktop/buildroot/output/host/lib CMakeFiles/cmTC_d27c7.dir/CheckSymbolExists.c.o -o cmTC_d27c7 -lm
gmake[3]: Leaving directory ‘/home/koti/buildroot-desktop/buildroot/output/build/host-llvm-15.0.0/buildroot-build/CMakeFiles/CMakeTmp’
gmake[2]: Leaving directory ‘/home/koti/buildroot-desktop/buildroot/output/build/host-llvm-15.0.0/buildroot-build/CMakeFiles/CMakeTmp’

File /home/koti/buildroot-desktop/buildroot/output/build/host-llvm-15.0.0/buildroot-build/CMakeFiles/CMakeTmp/CheckSymbolExists.c:
/* */
#include <unistd.h>

int main(int argc, char** argv)
{
(void)argv;
#ifndef sbrk
return ((int*)(&sbrk))[argc];
#else
(void)argc;
return 0;
#endif
}
Determining if the strerror exist passed with the following output:
Change Dir: /home/koti/buildroot-desktop/buildroot/output/build/host-llvm-15.0.0/buildroot-build/CMakeFiles/CMakeTmp

Run Build Command(s):/usr/bin/gmake -f Makefile cmTC_307c3/fast && gmake[2]: Entering directory ‘/home/koti/buildroot-desktop/buildroot/output/build/host-llvm-15.0.0/buildroot-build/CMakeFiles/CMakeTmp’
/usr/bin/gmake -f CMakeFiles/cmTC_307c3.dir/build.make CMakeFiles/cmTC_307c3.dir/build
gmake[3]: Entering directory ‘/home/koti/buildroot-desktop/buildroot/output/build/host-llvm-15.0.0/buildroot-build/CMakeFiles/CMakeTmp’
Building C object CMakeFiles/cmTC_307c3.dir/CheckSymbolExists.c.o
/usr/bin/gcc -O2 -I/home/koti/buildroot-desktop/buildroot/output/host/include -o CMakeFiles/cmTC_307c3.dir/CheckSymbolExists.c.o -c /home/koti/buildroot-desktop/buildroot/output/build/host-llvm-15.0.0/buildroot-build/CMakeFiles/CMakeTmp/CheckSymbolExists.c
Linking C executable cmTC_307c3
/usr/bin/cmake -E cmake_link_script CMakeFiles/cmTC_307c3.dir/link.txt --verbose=1
/usr/bin/gcc -O2 -I/home/koti/buildroot-desktop/buildroot/output/host/include -L/home/koti/buildroot-desktop/buildroot/output/host/lib -Wl,-rpath,/home/koti/buildroot-desktop/buildroot/output/host/lib CMakeFiles/cmTC_307c3.dir/CheckSymbolExists.c.o -o cmTC_307c3 -lm
gmake[3]: Leaving directory ‘/home/koti/buildroot-desktop/buildroot/output/build/host-llvm-15.0.0/buildroot-build/CMakeFiles/CMakeTmp’
gmake[2]: Leaving directory ‘/home/koti/buildroot-desktop/buildroot/output/build/host-llvm-15.0.0/buildroot-build/CMakeFiles/CMakeTmp’

File /home/koti/buildroot-desktop/buildroot/output/build/host-llvm-15.0.0/buildroot-build/CMakeFiles/CMakeTmp/CheckSymbolExists.c:
/* */
#include <string.h>

int main(int argc, char** argv)
{
(void)argv;
#ifndef strerror
return ((int*)(&strerror))[argc];
#else
(void)argc;
return 0;
#endif
}
Determining if the strerror_r exist passed with the following output:
Change Dir: /home/koti/buildroot-desktop/buildroot/output/build/host-llvm-15.0.0/buildroot-build/CMakeFiles/CMakeTmp

Run Build Command(s):/usr/bin/gmake -f Makefile cmTC_09362/fast && gmake[2]: Entering directory ‘/home/koti/buildroot-desktop/buildroot/output/build/host-llvm-15.0.0/buildroot-build/CMakeFiles/CMakeTmp’
/usr/bin/gmake -f CMakeFiles/cmTC_09362.dir/build.make CMakeFiles/cmTC_09362.dir/build
gmake[3]: Entering directory ‘/home/koti/buildroot-desktop/buildroot/output/build/host-llvm-15.0.0/buildroot-build/CMakeFiles/CMakeTmp’
Building C object CMakeFiles/cmTC_09362.dir/CheckSymbolExists.c.o
/usr/bin/gcc -O2 -I/home/koti/buildroot-desktop/buildroot/output/host/include -o CMakeFiles/cmTC_09362.dir/CheckSymbolExists.c.o -c /home/koti/buildroot-desktop/buildroot/output/build/host-llvm-15.0.0/buildroot-build/CMakeFiles/CMakeTmp/CheckSymbolExists.c
Linking C executable cmTC_09362
/usr/bin/cmake -E cmake_link_script CMakeFiles/cmTC_09362.dir/link.txt --verbose=1
/usr/bin/gcc -O2 -I/home/koti/buildroot-desktop/buildroot/output/host/include -L/home/koti/buildroot-desktop/buildroot/output/host/lib -Wl,-rpath,/home/koti/buildroot-desktop/buildroot/output/host/lib CMakeFiles/cmTC_09362.dir/CheckSymbolExists.c.o -o cmTC_09362 -lm
gmake[3]: Leaving directory ‘/home/koti/buildroot-desktop/buildroot/output/build/host-llvm-15.0.0/buildroot-build/CMakeFiles/CMakeTmp’
gmake[2]: Leaving directory ‘/home/koti/buildroot-desktop/buildroot/output/build/host-llvm-15.0.0/buildroot-build/CMakeFiles/CMakeTmp’

File /home/koti/buildroot-desktop/buildroot/output/build/host-llvm-15.0.0/buildroot-build/CMakeFiles/CMakeTmp/CheckSymbolExists.c:
/* */
#include <string.h>

int main(int argc, char** argv)
{
(void)argv;
#ifndef strerror_r
return ((int*)(&strerror_r))[argc];
#else
(void)argc;
return 0;
#endif
}
Determining if the setenv exist passed with the following output:
Change Dir: /home/koti/buildroot-desktop/buildroot/output/build/host-llvm-15.0.0/buildroot-build/CMakeFiles/CMakeTmp

Run Build Command(s):/usr/bin/gmake -f Makefile cmTC_1e433/fast && gmake[2]: Entering directory ‘/home/koti/buildroot-desktop/buildroot/output/build/host-llvm-15.0.0/buildroot-build/CMakeFiles/CMakeTmp’
/usr/bin/gmake -f CMakeFiles/cmTC_1e433.dir/build.make CMakeFiles/cmTC_1e433.dir/build
gmake[3]: Entering directory ‘/home/koti/buildroot-desktop/buildroot/output/build/host-llvm-15.0.0/buildroot-build/CMakeFiles/CMakeTmp’
Building C object CMakeFiles/cmTC_1e433.dir/CheckSymbolExists.c.o
/usr/bin/gcc -O2 -I/home/koti/buildroot-desktop/buildroot/output/host/include -o CMakeFiles/cmTC_1e433.dir/CheckSymbolExists.c.o -c /home/koti/buildroot-desktop/buildroot/output/build/host-llvm-15.0.0/buildroot-build/CMakeFiles/CMakeTmp/CheckSymbolExists.c
Linking C executable cmTC_1e433
/usr/bin/cmake -E cmake_link_script CMakeFiles/cmTC_1e433.dir/link.txt --verbose=1
/usr/bin/gcc -O2 -I/home/koti/buildroot-desktop/buildroot/output/host/include -L/home/koti/buildroot-desktop/buildroot/output/host/lib -Wl,-rpath,/home/koti/buildroot-desktop/buildroot/output/host/lib CMakeFiles/cmTC_1e433.dir/CheckSymbolExists.c.o -o cmTC_1e433 -lm
gmake[3]: Leaving directory ‘/home/koti/buildroot-desktop/buildroot/output/build/host-llvm-15.0.0/buildroot-build/CMakeFiles/CMakeTmp’
gmake[2]: Leaving directory ‘/home/koti/buildroot-desktop/buildroot/output/build/host-llvm-15.0.0/buildroot-build/CMakeFiles/CMakeTmp’

File /home/koti/buildroot-desktop/buildroot/output/build/host-llvm-15.0.0/buildroot-build/CMakeFiles/CMakeTmp/CheckSymbolExists.c:
/* */
#include <stdlib.h>

int main(int argc, char** argv)
{
(void)argv;
#ifndef setenv
return ((int*)(&setenv))[argc];
#else
(void)argc;
return 0;
#endif
}
Determining if the dlopen exist passed with the following output:
Change Dir: /home/koti/buildroot-desktop/buildroot/output/build/host-llvm-15.0.0/buildroot-build/CMakeFiles/CMakeTmp

Run Build Command(s):/usr/bin/gmake -f Makefile cmTC_cf483/fast && gmake[2]: Entering directory ‘/home/koti/buildroot-desktop/buildroot/output/build/host-llvm-15.0.0/buildroot-build/CMakeFiles/CMakeTmp’
/usr/bin/gmake -f CMakeFiles/cmTC_cf483.dir/build.make CMakeFiles/cmTC_cf483.dir/build
gmake[3]: Entering directory ‘/home/koti/buildroot-desktop/buildroot/output/build/host-llvm-15.0.0/buildroot-build/CMakeFiles/CMakeTmp’
Building C object CMakeFiles/cmTC_cf483.dir/CheckSymbolExists.c.o
/usr/bin/gcc -O2 -I/home/koti/buildroot-desktop/buildroot/output/host/include -o CMakeFiles/cmTC_cf483.dir/CheckSymbolExists.c.o -c /home/koti/buildroot-desktop/buildroot/output/build/host-llvm-15.0.0/buildroot-build/CMakeFiles/CMakeTmp/CheckSymbolExists.c
Linking C executable cmTC_cf483
/usr/bin/cmake -E cmake_link_script CMakeFiles/cmTC_cf483.dir/link.txt --verbose=1
/usr/bin/gcc -O2 -I/home/koti/buildroot-desktop/buildroot/output/host/include -L/home/koti/buildroot-desktop/buildroot/output/host/lib -Wl,-rpath,/home/koti/buildroot-desktop/buildroot/output/host/lib CMakeFiles/cmTC_cf483.dir/CheckSymbolExists.c.o -o cmTC_cf483 -lm -ldl
gmake[3]: Leaving directory ‘/home/koti/buildroot-desktop/buildroot/output/build/host-llvm-15.0.0/buildroot-build/CMakeFiles/CMakeTmp’
gmake[2]: Leaving directory ‘/home/koti/buildroot-desktop/buildroot/output/build/host-llvm-15.0.0/buildroot-build/CMakeFiles/CMakeTmp’

File /home/koti/buildroot-desktop/buildroot/output/build/host-llvm-15.0.0/buildroot-build/CMakeFiles/CMakeTmp/CheckSymbolExists.c:
/* */
#include <dlfcn.h>

int main(int argc, char** argv)
{
(void)argv;
#ifndef dlopen
return ((int*)(&dlopen))[argc];
#else
(void)argc;
return 0;
#endif
}
Performing C SOURCE FILE Test HAVE_STRUCT_STAT_ST_MTIM_TV_NSEC succeeded with the following output:
Change Dir: /home/koti/buildroot-desktop/buildroot/output/build/host-llvm-15.0.0/buildroot-build/CMakeFiles/CMakeTmp

Run Build Command(s):/usr/bin/gmake -f Makefile cmTC_a4c57/fast && gmake[2]: Entering directory ‘/home/koti/buildroot-desktop/buildroot/output/build/host-llvm-15.0.0/buildroot-build/CMakeFiles/CMakeTmp’
/usr/bin/gmake -f CMakeFiles/cmTC_a4c57.dir/build.make CMakeFiles/cmTC_a4c57.dir/build
gmake[3]: Entering directory ‘/home/koti/buildroot-desktop/buildroot/output/build/host-llvm-15.0.0/buildroot-build/CMakeFiles/CMakeTmp’
Building C object CMakeFiles/cmTC_a4c57.dir/src.c.o
/usr/bin/gcc -DHAVE_STRUCT_STAT_ST_MTIM_TV_NSEC -O2 -I/home/koti/buildroot-desktop/buildroot/output/host/include -o CMakeFiles/cmTC_a4c57.dir/src.c.o -c /home/koti/buildroot-desktop/buildroot/output/build/host-llvm-15.0.0/buildroot-build/CMakeFiles/CMakeTmp/src.c
Linking C executable cmTC_a4c57
/usr/bin/cmake -E cmake_link_script CMakeFiles/cmTC_a4c57.dir/link.txt --verbose=1
/usr/bin/gcc -O2 -I/home/koti/buildroot-desktop/buildroot/output/host/include -L/home/koti/buildroot-desktop/buildroot/output/host/lib -Wl,-rpath,/home/koti/buildroot-desktop/buildroot/output/host/lib CMakeFiles/cmTC_a4c57.dir/src.c.o -o cmTC_a4c57 -lm
gmake[3]: Leaving directory ‘/home/koti/buildroot-desktop/buildroot/output/build/host-llvm-15.0.0/buildroot-build/CMakeFiles/CMakeTmp’
gmake[2]: Leaving directory ‘/home/koti/buildroot-desktop/buildroot/output/build/host-llvm-15.0.0/buildroot-build/CMakeFiles/CMakeTmp’

Source file was:

#include <sys/types.h>
#include <sys/stat.h>

int main()
{
(void)sizeof(((struct stat *)0)->st_mtim.tv_nsec);
return 0;
}

Determining if the GLIBC exist passed with the following output:
Change Dir: /home/koti/buildroot-desktop/buildroot/output/build/host-llvm-15.0.0/buildroot-build/CMakeFiles/CMakeTmp

Run Build Command(s):/usr/bin/gmake -f Makefile cmTC_da6f7/fast && gmake[2]: Entering directory '/home/koti/buildroot-desktop/buildroot

@tobiashieta It seems that per-package tarballs do not include common cmake code from llvm-project/cmake at main · llvm/llvm-project · GitHub

Ah. I wonder if it should just be included and that will work or if it needs some more development.

As a workaround for now - you need to grab the big source package or checkout from Git.

Dear tobiashieta

As a workaround for now - you need to grab the big source package or checkout >>from Git.
I am using tar ball source downloaded from below github link .
https://github.com/llvm/llvm-project/releases/download/llvmorg-15.0.0/llvm-15.0.0.src.tar.xz
of course, builtdroot package (llvm/llvm.mk) ensure llvm-15.0.0 source downloaded from above link and extracted for configuration and subsequent compilation.

Regards
Koti

Try this one: https://github.com/llvm/llvm-project/releases/download/llvmorg-15.0.0/llvm-project-15.0.0.src.tar.xz

Hi
Proposed link source in previous comment is failing with no CMakefile.txt found error

Regards
Koti

Hi

I am using buildroot environment to compile llvm/ clang/ lld packages in sequential order one after another which are dependent too .

Regards
Koti

That’s because the cmake file is in the llvm subdir.

Maybe try the beginners documentation that walks through the building?

https://llvm.org/docs/GettingStarted.html

To address the original issue, if you want to perform standalone builds using the tarballs for individual projects, the way to do this as of LLVM 15 is to download and unpack both llvm-*.tar.xz (or some other subproject) and cmake-*.tar.xz.

Then you either need to rename the unpacked cmake-* directory to just cmake (and make sure it is placed side-by-side with the subproject directory, not nested inside it) or else use CMAKE_MODULE_PATH to point to cmake-*/Modules.

It would be a bit nicer if we changed LLVM_COMMON_CMAKE_UTILS into a cached variable, in which case it would be possible to just point LLVM_COMMON_CMAKE_UTILS to the cmake-* directory.

All that said, casual users should definitely prefer to just download the whole llvm-project-*.tar.xz tarball and build from there. This is the standard, and as such much more widely used and tested, build configuration.

We should make sure to document this if it’s a configuration we will keep. And maybe even test somehow.

I just want to second the advise of just using the monorepo layout until one is more familiar with what’s going on / able to debug things themselves. If you are worried about extra information “leaking” into the build, you can delete things which should already be built. We do that with our Nixpkgs LLVM builds somewhat; see nixpkgs/default.nix at master · NixOS/nixpkgs · GitHub for example.

It would be a bit nicer if we changed LLVM_COMMON_CMAKE_UTILS into a cached variable, in which case it would be possible to just point LLVM_COMMON_CMAKE_UTILS to the cmake-* directory.

I would support that.

Dear all,

My requirement is it build llvm-14.x/15.x package in Builtdroot environment.
Buildroot code contains llvm package with below files
{{
image
}}
llvm.mk contains source download path, configure settings etc.
Now, the proposed method in previous comments, may not help for me to build llvm package in buildroot environment.

that’s why i just gone through in more detail on below link

and ported below patch that is proposed as fix.

As per above link, i reverted below patch in llvm-14.0.6 version code to ensure the code is same above link proposed fix patch.
{{
commit 23d08271a4b24f21a88bfe73a5ea31c1e2c6365c
Author: Aaron Puchert aaronpuchert@alice-dsl.net
Date: Mon Mar 21 15:28:27 2022 +0100

Add cmake/ to release tarballs via concatenation

The solution using append was reported not to work, but additionally it
would use the contents of the checked-out source tree instead of the git
tag or commit. This uses `git archive`, so it will use the right commit,
and at least for me (with GNU tar) it seems to work as intended.

Should fix #53281.

}}

Compilation still fails with same error reported in first comment of this discourse.

Regards
Koti

Dear All,

The configure error mentioned in my first comment of this ticket is resolved with
after porting below link patch

Build continued after inclusion of above link patch and LLVM compilation is OK.
but i noticed below failure in CLANG package compilation.
{{
[ 85%] Built target clangToolingCore
[ 85%] Building CXX object lib/StaticAnalyzer/Checkers/CMakeFiles/obj.clangStaticAnalyzerCheckers.dir/ObjCContainersChecker.cpp.o
[ 85%] Building CXX object lib/StaticAnalyzer/Checkers/CMakeFiles/obj.clangStaticAnalyzerCheckers.dir/ObjCMissingSuperCallChecker.cpp.o
x86_64-linux-gnu-g++.br_real: fatal error: Killed signal terminated program cc1plus
compilation terminated.
make[3]: *** [lib/Sema/CMakeFiles/obj.clangSema.dir/build.make:635: lib/Sema/CMakeFiles/obj.clangSema.dir/SemaTemplate.cpp.o] Error 1
}}
Request to provide some input in finding fix for above error?

Regards
Koti

Most likely you are running out of memory. Check the kernel logs for OOM killers.

Dear tobiashieta

Most likely you are running out of memory. Check the kernel logs for OOM killers.
This issue is observed while building clang source code (clang-14.0.6) but not while building kernel using clang compiler.
So i checked clang build log and didn’t observed any OOM killer specific log.
From below link,
c++: fatal error: Killed signal terminated program cc1plus · Issue #280 · soedinglab/hh-suite · GitHub
Proposed solution as

  1. try by reducing compilation threads number
  2. Increase RAM size etc.

Can you please let me know your opinion on above steps?

Regards
Koti